{"text_format":"1","workbook":"xlsx","n_sheets":6,"sheets":["Datos","TD","Menu","Informe_Poblacion_General","Avance_Meta_Fisica_Pob_Asignada","Avance_Meta_Fisica_SinPob_Asig"],"not_rendered":{"charts":0,"images":39,"macros":1,"external_links":1,"defined_names":2,"comments":0,"pivot_tables":5},"unopened":[],"bounds":{"document_bytes":16777216,"sheet_cells":100000,"rows_first":2000,"rows_last":500,"rows_between":2000,"halvings":0,"cell_chars":16384,"cell_head_chars":4096},"cells_cut":0,"cells_raw":0,"read":"whole","date_system":"1900"}

{"sheet":"Datos","index":0,"n_rows":438,"n_cols":36,"rows_kept":438,"cut":false,"hidden":true,"merged":[]}
[]
[]
[]
[]
[]
[]
[]
[]
[null,"ANO",null,"MESES",null,"COD_RED","DESC_RED","RED",null,"COD_RED","COD_MIC","DESC_MICRO","MICROREDES",null,"COD_ESTAB","DESC_ESTAB","COD_RED","COD_MIC","COD_PROV","COD_DIST","REDMIC","CONCATENAR",null,"COD_PROV","DESC_PROV","CONCATENAR",null,"COD_PROV","COD_DIST","DESC_DIST","PROVDIST","CONCATENAR",null,"UE"]
[null,2024,null,"01-Enero",null,"01","CUSCO SUR",{"$f":"CONCATENATE(F10,\" - \",G10)","v":"01 - CUSCO SUR"},null,"00","00","NO PERTENECE A NINGUNA MICRORED                                                                     ",{"$f":"CONCATENATE(J10,K10,\" - \",L10)","v":"0000 - NO PERTENECE A NINGUNA MICRORED                                                                     "},null,"000000000","(All)","07","00",null,null,{"$f":"CONCATENATE(Q10,R10)","v":"0700"},{"$f":"CONCATENATE(O10,\" - \",P10)","v":"000000000 - (All)"},null,"00","(All)",{"$f":"CONCATENATE(X10,\" - \",Y10)","v":"00 - (All)"},null,"01","00","(All)",{"$f":"CONCATENATE(AB10,AC10)","v":"0100"},{"$f":"CONCATENATE(AB10,AC10,\" - \",AD10)","v":"0100 - (All)"},null,"COD_RED","DESC_RED","CONCATENAR"]
[null,null,null,"02-Febrero",null,"02","CUSCO NORTE","02 - CUSCO NORTE",null,"00","99","(All)",{"$f":"CONCATENATE(J11,K11,\" - \",L11)","v":"0099 - (All)"},null,"000002289","HOSPITAL REGIONAL CUSCO","07","00","01","01",{"$f":"CONCATENATE(Q11,R11)","v":"0700"},{"$f":"CONCATENATE(O11,\" - \",P11)","v":"000002289 - HOSPITAL REGIONAL CUSCO"},null,"01","CUSCO",{"$f":"CONCATENATE(X11,\" - \",Y11)","v":"01 - CUSCO"},null,"01","01","CUSCO",{"$f":"CONCATENATE(AB11,AC11)","v":"0101"},{"$f":"CONCATENATE(AB11,AC11,\" - \",AD11)","v":"0101 - CUSCO"},null,1129,"UE - SALUD CANAS - CANCHIS - ESPINAR",{"$f":"CONCATENATE(AH11,\" - \",AI11)","v":"1129 - UE - SALUD CANAS - CANCHIS - ESPINAR"}]
[null,null,null,"03-Marzo",null,"03","LA CONVENCION","03 - LA CONVENCION",null,"01","00","HOSPITAL","0100 - HOSPITAL",null,"000002305","HOSPITAL ANTONIO LORENA","07","00","01","06",{"$f":"CONCATENATE(Q12,R12)","v":"0700"},"000002305 - HOSPITAL ANTONIO LORENA",null,"02","ACOMAYO",{"$f":"CONCATENATE(X12,\" - \",Y12)","v":"02 - ACOMAYO"},null,"01","02","CCORCA","0102","0102 - CCORCA",null,1130,"UE - HOSPITAL REGIONAL CUSCO",{"$f":"CONCATENATE(AH12,\" - \",AI12)","v":"1130 - UE - HOSPITAL REGIONAL CUSCO"}]
[null,null,null,"04-Abril",null,"04","CANAS-CANCHIS-ESPINAR","04 - CANAS-CANCHIS-ESPINAR",null,"01","03","PARURO                                                                                              ","0103 - PARURO                                                                                              ",null,"999999999","(All)","07","99",null,null,{"$f":"CONCATENATE(Q13,R13)","v":"0799"},"999999999 - (All)",null,"03","ANTA","03 - ANTA",null,"01","03","POROY","0103","0103 - POROY",null,1169,"UE - HOSPITAL ANTONIO LORENA","1169 - UE - HOSPITAL ANTONIO LORENA"]
[null,null,null,"05-Mayo",null,"05","KIMBIRI PICHARI","05 - KIMBIRI PICHARI",null,"01","06","PAUCARTAMBO                                                                                         ","0106 - PAUCARTAMBO                                                                                         ",null,"000025210","TUPAC AMARU","01","00","01","05","0100","000025210 - TUPAC AMARU",null,"04","CALCA","04 - CALCA",null,"01","04","SAN JERONIMO","0104","0104 - SAN JERONIMO",null,1170,"UE - SALUD LA CONVENCION","1170 - UE - SALUD LA CONVENCION"]
[null,null,null,"06-Junio",null,"06","CHUMBIVILCAS","06 - CHUMBIVILCAS",null,"01","12","URCOS                                                                                               ","0112 - URCOS                                                                                               ",null,"000000000","(All)","01","16",null,null,{"$f":"CONCATENATE(Q15,R15)","v":"0116"},{"$f":"CONCATENATE(O15,\" - \",P15)","v":"000000000 - (All)"},null,"05","CANAS","05 - CANAS",null,"01","05","SAN SEBASTIAN","0105","0105 - SAN SEBASTIAN",null,1322,"UE - SALUD CUSCO SUR","1322 - UE - SALUD CUSCO SUR"]
[null,null,null,"07-Julio",null,"07","HOSPITALES III",{"$f":"CONCATENATE(F16,\" - \",G16)","v":"07 - HOSPITALES III"},null,"01","13","ACOMAYO                                                                                             ","0113 - ACOMAYO                                                                                             ",null,"000002300","SAN JERONIMO                                                                                        ","01","16","01","04","0116","000002300 - SAN JERONIMO                                                                                        ",null,"06","CANCHIS","06 - CANCHIS",null,"01","06","SANTIAGO","0106","0106 - SANTIAGO",null,1347,"UE - SALUD KIMBIRI PICHARI","1347 - UE - SALUD KIMBIRI PICHARI"]
[null,null,null,"08-Agosto",null,"99","(All)",{"$f":"CONCATENATE(F17,\" - \",G17)","v":"99 - (All)"},null,"01","15","OCONGATE                                                                                            ","0115 - OCONGATE                                                                                            ",null,"000002301","SAN SEBASTIAN                                                                                       ","01","16","01","05","0116","000002301 - SAN SEBASTIAN                                                                                       ",null,"07","CHUMBIVILCAS","07 - CHUMBIVILCAS",null,"01","07","SAYLLA","0107","0107 - SAYLLA",null,1348,"UE - SALUD CUSCO NORTE","1348 - UE - SALUD CUSCO NORTE"]
[null,null,null,"09-Setiembre",null,null,null,null,null,"01","16","CUSCO","0116 - CUSCO",null,"000002303","SANTA ROSA                                                                                          ","01","16","01","05","0116","000002303 - SANTA ROSA                                                                                          ",null,"08","ESPINAR","08 - ESPINAR",null,"01","08","WANCHAQ","0108","0108 - WANCHAQ",null,1547,"UE - HOSPITAL ESPINAR","1547 - UE - HOSPITAL ESPINAR"]
[null,null,null,"10-Octubre",null,null,null,null,null,"01","99","(All)","0199 - (All)",null,"000002314","SAYLLA                                                                                              ","01","16","01","07","0116","000002314 - SAYLLA                                                                                              ",null,"09","LA CONVENCION","09 - LA CONVENCION",null,"02","00","(All)","0200","0200 - (All)",null,1625,"UE - HOSPITAL SICUANI","1625 - UE - HOSPITAL SICUANI"]
[null,null,null,"11-Noviembre",null,null,null,null,null,"02","01","BELEMPAMPA                                                                                          ","0201 - BELEMPAMPA                                                                                          ",null,"000002323","RONDOCAN                                                                                            ","01","16","02","06","0116","000002323 - RONDOCAN                                                                                            ",null,"10","PARURO","10 - PARURO",null,"02","01","ACOMAYO","0201","0201 - ACOMAYO",null,1626,"UE - HOSPITAL QUILLABAMBA","1626 - UE - HOSPITAL QUILLABAMBA"]
[null,null,null,"12-Diciembre",null,null,null,null,null,"02","02","WANCHAQ                                                                                             ","0202 - WANCHAQ                                                                                             ",null,"000007699","CONCHACALLE                                                                                         ","01","16","01","04","0116","000007699 - CONCHACALLE                                                                                         ",null,"11","PAUCARTAMBO","11 - PAUCARTAMBO",null,"02","02","ACOPIA","0202","0202 - ACOPIA",null,1666,"UE - SALUD CHUMBIVILCAS","1666 - UE - SALUD CHUMBIVILCAS"]
[null,null,null,null,null,null,null,null,null,"02","03","ANTA                                                                                                ","0203 - ANTA                                                                                                ",null,"000010065","ESSALUD-SAN SEBASTIAN","01","16","01","05","0116","000010065 - ESSALUD-SAN SEBASTIAN",null,"12","QUISPICANCHI","12 - QUISPICANCHI",null,"02","03","ACOS","0203","0203 - ACOS",null,"7777","(All)",{"$f":"CONCATENATE(AH22,\" - \",AI22)","v":"7777 - (All)"}]
[null,null,null,null,null,null,null,null,null,"02","04","LIMATAMBO                                                                                           ","0204 - LIMATAMBO                                                                                           ",null,"000011743","SANIDAD-SANTA ROSA PNP","01","16","01","05","0116","000011743 - SANIDAD-SANTA ROSA PNP",null,"13","URUBAMBA","13 - URUBAMBA",null,"02","04","MOSOC LLACTA","0204","0204 - MOSOC LLACTA"]
[null,null,null,null,null,null,null,null,null,"02","05","PISAC                                                                                               ","0205 - PISAC                                                                                               ",null,"000026181","MENTAL SAN SEBASTIAN","01","16","01","05","0116","000026181 - MENTAL SAN SEBASTIAN",null,null,null,null,null,"02","05","POMACANCHI","0205","0205 - POMACANCHI"]
[null,null,null,null,null,null,null,null,null,"02","06","CALCA                                                                                               ","0206 - CALCA                                                                                               ",null,"000030727","PATRÓN SAN SEBASTIAN","01","16","01","04",{"$f":"CONCATENATE(Q25,R25)","v":"0116"},"000030727 - PATRÓN SAN SEBASTIAN",null,null,null,null,null,"02","06","RONDOCAN","0206","0206 - RONDOCAN"]
[null,null,null,null,null,null,null,null,null,"02","07","URUBAMBA                                                                                            ","0207 - URUBAMBA                                                                                            ",null,"000000000","(All)","01","03",null,null,{"$f":"CONCATENATE(Q26,R26)","v":"0103"},"000000000 - (All)",null,null,null,null,null,"02","07","SANGARARA","0207","0207 - SANGARARA"]
[null,null,null,null,null,null,null,null,null,"02","08","YANATILE                                                                                            ","0208 - YANATILE                                                                                            ",null,"000002499","PARURO                                                                                              ","01","03",10,"01","0103","000002499 - PARURO                                                                                              ",null,null,null,null,null,"03","00","(All)","0300","0300 - (All)"]
[null,null,null,null,null,null,null,null,null,"02","09","SIETE CUARTONES                                                                                     ","0209 - SIETE CUARTONES                                                                                     ",null,"000002500","ACCHA                                                                                               ","01","03",10,"02","0103","000002500 - ACCHA                                                                                               ",null,null,null,null,null,"03","01","ANTA","0301","0301 - ANTA"]
[null,null,null,null,null,null,null,null,null,"02","99","(All)","0299 - (All)",null,"000002501","CCAPI                                                                                               ","01","03",10,"03","0103","000002501 - CCAPI                                                                                               ",null,null,null,null,null,"03","02","ANCAHUASI","0302","0302 - ANCAHUASI"]
[null,null,null,null,null,null,null,null,null,"03","00","HOSPITAL","0300 - HOSPITAL",null,"000002502","CCOYABAMBA                                                                                          ","01","03",10,"03","0103","000002502 - CCOYABAMBA                                                                                          ",null,null,null,null,null,"03","03","CACHIMAYO","0303","0303 - CACHIMAYO"]
[null,null,null,null,null,null,null,null,null,"03","01","SANTA ANA                                                                                           ","0301 - SANTA ANA                                                                                           ",null,"000002503","COLCHA                                                                                              ","01","03",10,"04","0103","000002503 - COLCHA                                                                                              ",null,null,null,null,null,"03","04","CHINCHAYPUJIO","0304","0304 - CHINCHAYPUJIO"]
[null,null,null,null,null,null,null,null,null,"03","02","MARANURA                                                                                            ","0302 - MARANURA                                                                                            ",null,"000002504","HUANOQUITE                                                                                          ","01","03",10,"05","0103","000002504 - HUANOQUITE                                                                                          ",null,null,null,null,null,"03","05","HUAROCONDO","0305","0305 - HUAROCONDO"]
[null,null,null,null,null,null,null,null,null,"03","03","QUELLOUNO                                                                                           ","0303 - QUELLOUNO                                                                                           ",null,"000002505","OMACHA                                                                                              ","01","03",10,"06","0103","000002505 - OMACHA                                                                                              ",null,null,null,null,null,"03","06","LIMATAMBO","0306","0306 - LIMATAMBO"]
[null,null,null,null,null,null,null,null,null,"03","04","KITENI                                                                                              ","0304 - KITENI                                                                                              ",null,"000002506","ANTAPALLPA                                                                                          ","01","03",10,"06","0103","000002506 - ANTAPALLPA                                                                                          ",null,null,null,null,null,"03","07","MOLLEPATA","0307","0307 - MOLLEPATA"]
[null,null,null,null,null,null,null,null,null,"03","05","KAMISEA                                                                                             ","0305 - KAMISEA                                                                                             ",null,"000002507","PACCARECTAMBO                                                                                       ","01","03",10,"07","0103","000002507 - PACCARECTAMBO                                                                                       ",null,null,null,null,null,"03","08","PUCYURA","0308","0308 - PUCYURA"]
[null,null,null,null,null,null,null,null,null,"03","06","PUCYURA                                                                                             ","0306 - PUCYURA                                                                                             ",null,"000002509","YAURISQUE                                                                                           ","01","03",10,"09","0103","000002509 - YAURISQUE                                                                                           ",null,null,null,null,null,"03","09","ZURITE","0309","0309 - ZURITE"]
[null,null,null,null,null,null,null,null,null,"03","99","(All)","0399 - (All)",null,"000006978","CCOCHIRIHUAY                                                                                        ","01","03",10,"04","0103","000006978 - CCOCHIRIHUAY                                                                                        ",null,null,null,null,null,"04","00","(All)","0400","0400 - (All)"]
[null,null,null,null,null,null,null,null,null,"04","00","HOSPITAL","0400 - HOSPITAL",null,"000007147","HUASQUILLAY                                                                                         ","01","03",10,"06","0103","000007147 - HUASQUILLAY                                                                                         ",null,null,null,null,null,"04","01","CALCA","0401","0401 - CALCA"]
[null,null,null,null,null,null,null,null,null,"04","01","YANAOCA                                                                                             ","0401 - YANAOCA                                                                                             ",null,"000012924","SAHUA SAHUA                                                                                         ","01","03",10,"06","0103","000012924 - SAHUA SAHUA                                                                                         ",null,null,null,null,null,"04","02","COYA","0402","0402 - COYA"]
[null,null,null,null,null,null,null,null,null,"04","02","EL DESCANSO                                                                                         ","0402 - EL DESCANSO                                                                                         ",null,"000000000","(All)","01","06",null,null,"0106","000000000 - (All)",null,null,null,null,null,"04","03","LAMAY","0403","0403 - LAMAY"]
[null,null,null,null,null,null,null,null,null,"04","03","COMBAPATA                                                                                           ","0403 - COMBAPATA                                                                                           ",null,"000002510","PAUCARTAMBO                                                                                         ","01","06",11,"01","0106","000002510 - PAUCARTAMBO                                                                                         ",null,null,null,null,null,"04","04","LARES","0404","0404 - LARES"]
[null,null,null,null,null,null,null,null,null,"04","04","TECHO OBRERO                                                                                        ","0404 - TECHO OBRERO                                                                                        ",null,"000002511","MOLLOMARCA                                                                                          ","01","06",11,"01","0106","000002511 - MOLLOMARCA                                                                                          ",null,null,null,null,null,"04","05","PISAC","0405","0405 - PISAC"]
[null,null,null,null,null,null,null,null,null,"04","05","PAMPAPHALLA                                                                                         ","0405 - PAMPAPHALLA                                                                                         ",null,"000002512","CAICAY                                                                                              ","01","06",11,"02","0106","000002512 - CAICAY                                                                                              ",null,null,null,null,null,"04","06","SAN SALVADOR","0406","0406 - SAN SALVADOR"]
[null,null,null,null,null,null,null,null,null,"04","06","YAURI                                                                                               ","0406 - YAURI                                                                                               ",null,"000002513","HUASAC                                                                                              ","01","06",11,"02","0106","000002513 - HUASAC                                                                                              ",null,null,null,null,null,"04","07","TARAY","0407","0407 - TARAY"]
[null,null,null,null,null,null,null,null,null,"04","99","(All)","0499 - (All)",null,"000002514","CHALLABAMBA                                                                                         ","01","06",11,"03","0106","000002514 - CHALLABAMBA                                                                                         ",null,null,null,null,null,"04","08","YANATILE","0408","0408 - YANATILE"]
[null,null,null,null,null,null,null,null,null,"05","00","HOSPITAL","0500 - HOSPITAL",null,"000002516","COLQUEPATA                                                                                          ","01","06",11,"04","0106","000002516 - COLQUEPATA                                                                                          ",null,null,null,null,null,"05","00","(All)","0500","0500 - (All)"]
[null,null,null,null,null,null,null,null,null,"05","01","KIMBIRI                                                                                             ","0501 - KIMBIRI                                                                                             ",null,"000002517","PICHIHUA COLQUEPATA                                                                                 ","01","06",11,"04","0106","000002517 - PICHIHUA COLQUEPATA                                                                                 ",null,null,null,null,null,"05","01","YANAOCA","0501","0501 - YANAOCA"]
[null,null,null,null,null,null,null,null,null,"05","02","PICHARI                                                                                             ","0502 - PICHARI                                                                                             ",null,"000002518","VIZCOCHONI                                                                                          ","01","06",11,"04","0106","000002518 - VIZCOCHONI                                                                                          ",null,null,null,null,null,"05","02","CHECCA","0502","0502 - CHECCA"]
[null,null,null,null,null,null,null,null,null,"05","99","(All)","0599 - (All)",null,"000002519","AYRE                                                                                                ","01","06",11,"04","0106","000002519 - AYRE                                                                                                ",null,null,null,null,null,"05","03","KUNTURKANKI","0503","0503 - KUNTURKANKI"]
[null,null,null,null,null,null,null,null,null,"06","00","HOSPITAL","0600 - HOSPITAL",null,"000002520","HUANCARANI                                                                                          ","01","06",11,"05","0106","000002520 - HUANCARANI                                                                                          ",null,null,null,null,null,"05","04","LANGUI","0504","0504 - LANGUI"]
[null,null,null,null,null,null,null,null,null,"06","09","SANTO TOMAS                                                                                         ","0609 - SANTO TOMAS                                                                                         ",null,"000002521","PILCOPATA                                                                                           ","01","06",11,"06","0106","000002521 - PILCOPATA                                                                                           ",null,null,null,null,null,"05","05","LAYO","0505","0505 - LAYO"]
[null,null,null,null,null,null,null,null,null,"06","01","LIVITACA                                                                                            ","0601 - LIVITACA                                                                                            ",null,"000002522","PATRIA                                                                                              ","01","06",11,"06","0106","000002522 - PATRIA                                                                                              ",null,null,null,null,null,"05","06","PAMPAMARCA","0506","0506 - PAMPAMARCA"]
[null,null,null,null,null,null,null,null,null,"06","99","(All)","0699 - (All)",null,"000006979","TOCRA                                                                                               ","01","06",11,"04","0106","000006979 - TOCRA                                                                                               ",null,null,null,null,null,"05","07","QUEHUE","0507","0507 - QUEHUE"]
[null,null,null,null,null,null,null,null,null,"07","00","HOSPITAL","0700 - HOSPITAL",null,"000010077","ESSALUD-PAUCARTAMBO","01","06",11,"01","0106","000010077 - ESSALUD-PAUCARTAMBO",null,null,null,null,null,"05","08","TUPAC AMARU","0508","0508 - TUPAC AMARU"]
[null,null,null,null,null,null,null,null,null,"99","99","(All)",{"$f":"CONCATENATE(J55,K55,\" - \",L55)","v":"9999 - (All)"},null,"000033777","MENTAL COMUNITARIO VIRGEN DEL ROSARIO","01","06",11,"01","0106","000033777 - MENTAL COMUNITARIO VIRGEN DEL ROSARIO",null,null,null,null,null,"06","00","(All)","0600","0600 - (All)"]
[null,null,null,null,null,null,null,null,null,null,null,null,null,null,"000000000","(All)","01","12",null,null,"0112","000000000 - (All)",null,null,null,null,null,"06","01","SICUANI","0601","0601 - SICUANI"]
[null,null,null,null,null,null,null,null,null,null,null,null,null,null,"000002523","URCOS                                                                                               ","01","12",12,"01","0112","000002523 - URCOS                                                                                               ",null,null,null,null,null,"06","02","CHECACUPE","0602","0602 - CHECACUPE"]
[null,null,null,null,null,null,null,null,null,null,null,null,null,null,"000002525","ANDAHUAYLILLAS                                                                                      ","01","12",12,"02","0112","000002525 - ANDAHUAYLILLAS                                                                                      ",null,null,null,null,null,"06","03","COMBAPATA","0603","0603 - COMBAPATA"]
[null,null,null,null,null,null,null,null,null,null,null,null,null,null,"000002530","CUSIPATA                                                                                            ","01","12",12,"06","0112","000002530 - CUSIPATA                                                                                            ",null,null,null,null,null,"06","04","MARANGANI","0604","0604 - MARANGANI"]
[null,null,null,null,null,null,null,null,null,null,null,null,null,null,"000002532","HUARO                                                                                               ","01","12",12,"07","0112","000002532 - HUARO                                                                                               ",null,null,null,null,null,"06","05","PITUMARCA","0605","0605 - PITUMARCA"]
[null,null,null,null,null,null,null,null,null,null,null,null,null,null,"000002533","URPAY                                                                                               ","01","12",12,"07","0112","000002533 - URPAY                                                                                               ",null,null,null,null,null,"06","06","SAN PABLO","0606","0606 - SAN PABLO"]
[null,null,null,null,null,null,null,null,null,null,null,null,null,null,"000002534","LUCRE                                                                                               ","01","12",12,"08","0112","000002534 - LUCRE                                                                                               ",null,null,null,null,null,"06","07","SAN PEDRO","0607","0607 - SAN PEDRO"]
[null,null,null,null,null,null,null,null,null,null,null,null,null,null,"000002537","OROPESA                                                                                             ","01","12",12,11,"0112","000002537 - OROPESA                                                                                             ",null,null,null,null,null,"06","08","TINTA","0608","0608 - TINTA"]
[null,null,null,null,null,null,null,null,null,null,null,null,null,null,"000002538","QUIQUIJANA                                                                                          ","01","12",12,12,"0112","000002538 - QUIQUIJANA                                                                                          ",null,null,null,null,null,"07","00","(All)","0700","0700 - (All)"]
[null,null,null,null,null,null,null,null,null,null,null,null,null,null,"000002539","CCOLCA","01","12",12,12,"0112","000002539 - CCOLCA",null,null,null,null,null,"07","01","SANTO TOMAS","0701","0701 - SANTO TOMAS"]
[null,null,null,null,null,null,null,null,null,null,null,null,null,null,"000006980","CHILLIHUANI                                                                                         ","01","12",12,"06","0112","000006980 - CHILLIHUANI                                                                                         ",null,null,null,null,null,"07","02","CAPACMARCA","0702","0702 - CAPACMARCA"]
[null,null,null,null,null,null,null,null,null,null,null,null,null,null,"000008911","HUARA HUARA                                                                                         ","01","12",12,"05","0112","000008911 - HUARA HUARA                                                                                         ",null,null,null,null,null,"07","03","CHAMACA","0703","0703 - CHAMACA"]
[null,null,null,null,null,null,null,null,null,null,null,null,null,null,"000011747","SANIDAD-PUCUTO PNP","01","12",12,"07","0112","000011747 - SANIDAD-PUCUTO PNP",null,null,null,null,null,"07","04","COLQUEMARCA","0704","0704 - COLQUEMARCA"]
[null,null,null,null,null,null,null,null,null,null,null,null,null,null,"000026385","ESSALUD-URCOS","01","12",12,"01","0112","000026385 - ESSALUD-URCOS",null,null,null,null,null,"07","05","LIVITACA","0705","0705 - LIVITACA"]
[null,null,null,null,null,null,null,null,null,null,null,null,null,null,"000030708","MENTAL COMUNITARIO HUARO","01","12",12,"07","0112","000030708 - MENTAL COMUNITARIO HUARO",null,null,null,null,null,"07","06","LLUSCO","0706","0706 - LLUSCO"]
[null,null,null,null,null,null,null,null,null,null,null,null,null,null,"000000000","(All)","01","13",null,null,"0113","000000000 - (All)",null,null,null,null,null,"07","07","QUIÑOTA","0707","0707 - QUIÑOTA"]
[null,null,null,null,null,null,null,null,null,null,null,null,null,null,"000002317","ACOMAYO                                                                                             ","01","13","02","01","0113","000002317 - ACOMAYO                                                                                             ",null,null,null,null,null,"07","08","VELILLE","0708","0708 - VELILLE"]
[null,null,null,null,null,null,null,null,null,null,null,null,null,null,"000002318","ACOPIA                                                                                              ","01","13","02","02","0113","000002318 - ACOPIA                                                                                              ",null,null,null,null,null,"08","00","(All)","0800","0800 - (All)"]
[null,null,null,null,null,null,null,null,null,null,null,null,null,null,"000002319","ACOS                                                                                                ","01","13","02","03","0113","000002319 - ACOS                                                                                                ",null,null,null,null,null,"08","01","ESPINAR","0801","0801 - ESPINAR"]
[null,null,null,null,null,null,null,null,null,null,null,null,null,null,"000002321","CENTRO DE SALUD POMACANCHI","01","13","02","05","0113",{"$f":"CONCATENATE(O75,\" - \",P75)","v":"000002321 - CENTRO DE SALUD POMACANCHI"},null,null,null,null,null,"08","02","CONDOROMA",{"$f":"CONCATENATE(AB75,AC75)","v":"0802"},{"$f":"CONCATENATE(AB75,AC75,\" - \",AD75)","v":"0802 - CONDOROMA"}]
[null,null,null,null,null,null,null,null,null,null,null,null,null,null,"000002322","SAN JUAN DE POMACANCHI                                                                              ","01","13","02","05","0113","000002322 - SAN JUAN DE POMACANCHI                                                                              ",null,null,null,null,null,"08","03","COPORAQUE","0803","0803 - COPORAQUE"]
[null,null,null,null,null,null,null,null,null,null,null,null,null,null,"000002324","PUESTO DE SALUD SANGARARA","01","13","02","07","0113","000002324 - PUESTO DE SALUD SANGARARA",null,null,null,null,null,"08","04","OCORURO","0804","0804 - OCORURO"]
[null,null,null,null,null,null,null,null,null,null,null,null,null,null,"000002325","PUESTO DE SALUD MARCACONGA","01","13","02","07","0113","000002325 - PUESTO DE SALUD MARCACONGA",null,null,null,null,null,"08","05","PALLPATA","0805","0805 - PALLPATA"]
[null,null,null,null,null,null,null,null,null,null,null,null,null,null,"000002508","PILLPINTO                                                                                           ","01","13",10,"08","0113","000002508 - PILLPINTO                                                                                           ",null,null,null,null,null,"08","06","PICHIGUA","0806","0806 - PICHIGUA"]
[null,null,null,null,null,null,null,null,null,null,null,null,null,null,"000010076","ESSALUD-ACOMAYO","01","13","02","01","0113","000010076 - ESSALUD-ACOMAYO",null,null,null,null,null,"08","07","SUYCKUTAMBO","0807","0807 - SUYCKUTAMBO"]
[null,null,null,null,null,null,null,null,null,null,null,null,null,null,"000012926","SANTA  LUCIA                                                                                        ","01","13","02","05","0113","000012926 - SANTA  LUCIA                                                                                        ",null,null,null,null,null,"08","08","ALTO PICHIGUA","0808","0808 - ALTO PICHIGUA"]
[null,null,null,null,null,null,null,null,null,null,null,null,null,null,"000000000","(All)","01","15",null,null,"0115","000000000 - (All)",null,null,null,null,null,"09","00","(All)","0900","0900 - (All)"]
[null,null,null,null,null,null,null,null,null,null,null,null,null,null,"000002524","PAMPACAMARA                                                                                         ","01","15",12,"05","0115","000002524 - PAMPACAMARA                                                                                         ",null,null,null,null,null,"09","01","SANTA ANA","0901","0901 - SANTA ANA"]
[null,null,null,null,null,null,null,null,null,null,null,null,null,null,"000002526","QUINCE MIL","01","15",12,"03","0115","000002526 - QUINCE MIL",null,null,null,null,null,"09","02","ECHARATE","0902","0902 - ECHARATE"]
[null,null,null,null,null,null,null,null,null,null,null,null,null,null,"000002527","CCARHUAYO","01","15",12,"04","0115","000002527 - CCARHUAYO",null,null,null,null,null,"09","03","HUAYOPATA","0903","0903 - HUAYOPATA"]
[null,null,null,null,null,null,null,null,null,null,null,null,null,null,"000002528","CCATCCA                                                                                             ","01","15",12,"05","0115","000002528 - CCATCCA                                                                                             ",null,null,null,null,null,"09","04","MARANURA","0904","0904 - MARANURA"]
[null,null,null,null,null,null,null,null,null,null,null,null,null,null,"000002529","KCAURY                                                                                              ","01","15",12,"05","0115","000002529 - KCAURY                                                                                              ",null,null,null,null,null,"09","05","OCOBAMBA","0905","0905 - OCOBAMBA"]
[null,null,null,null,null,null,null,null,null,null,null,null,null,null,"000002535","MARCAPATA                                                                                           ","01","15",12,"09","0115","000002535 - MARCAPATA                                                                                           ",null,null,null,null,null,"09","06","QUELLOUNO","0906","0906 - QUELLOUNO"]
[null,null,null,null,null,null,null,null,null,null,null,null,null,null,"000002536","OCONGATE                                                                                            ","01","15",12,10,"0115","000002536 - OCONGATE                                                                                            ",null,null,null,null,null,"09","07","KIMBIRI","0907","0907 - KIMBIRI"]
[null,null,null,null,null,null,null,null,null,null,null,null,null,null,"000006977","TINKI                                                                                               ","01","15",12,10,{"$f":"CONCATENATE(Q90,R90)","v":"0115"},"000006977 - TINKI                                                                                               ",null,null,null,null,null,"09","08","SANTA TERESA","0908","0908 - SANTA TERESA"]
[null,null,null,null,null,null,null,null,null,null,null,null,null,null,"000007110","INCACANCHA                                                                                          ","01","15",12,"09","0115","000007110 - INCACANCHA                                                                                          ",null,null,null,null,null,"09","09","VILCABAMBA","0909","0909 - VILCABAMBA"]
[null,null,null,null,null,null,null,null,null,null,null,null,null,null,"000012931","CHICHINA                                                                                            ","01","15",12,"05","0115","000012931 - CHICHINA                                                                                            ",null,null,null,null,null,"09","10","PICHARI","0910","0910 - PICHARI"]
[null,null,null,null,null,null,null,null,null,null,null,null,null,null,"000016335","CCAPANA                                                                                             ","01","15",12,"05","0115","000016335 - CCAPANA                                                                                             ",null,null,null,null,null,"09","11","INKAWASI                                ","0911","0911 - INKAWASI                                "]
[null,null,null,null,null,null,null,null,null,null,null,null,null,null,"999999999","(All)","01","99",null,null,"0199","999999999 - (All)",null,null,null,null,null,"09","12","VILLA VIRGEN","0912","0912 - VILLA VIRGEN"]
[null,null,null,null,null,null,null,null,null,null,null,null,null,null,"000000000","(All)","02","01",null,null,"0201","000000000 - (All)",null,null,null,null,null,"09","13","VILLA KINTIARINA","0913","0913 - VILLA KINTIARINA"]
[null,null,null,null,null,null,null,null,null,null,null,null,null,null,"000002292","INDEPENDENCIA                                                                                       ","02","01","01","01","0201","000002292 - INDEPENDENCIA                                                                                       ",null,null,null,null,null,"09","14","MEGANTONI","0914","0914 - MEGANTONI"]
[null,null,null,null,null,null,null,null,null,null,null,null,null,null,"000002297","CCORCCA                                                                                             ","02","01","01","02","0201","000002297 - CCORCCA                                                                                             ",null,null,null,null,null,"09","15","KUMPIRUSHIATO","0915","0915 - KUMPIRUSHIATO"]
[null,null,null,null,null,null,null,null,null,null,null,null,null,null,"000002306","BELEMPAMPA                                                                                          ","02","01","01","06","0201","000002306 - BELEMPAMPA                                                                                          ",null,null,null,null,null,"09","16","CIELO PUNCO","0916","0916 - CIELO PUNCO"]
[null,null,null,null,null,null,null,null,null,null,null,null,null,null,"000002308","ZARZUELA ALTA                                                                                       ","02","01","01","06","0201","000002308 - ZARZUELA ALTA                                                                                       ",null,null,null,null,null,"09","17","MANITEA","0917","0917 - MANITEA"]
[null,null,null,null,null,null,null,null,null,null,null,null,null,null,"000002309","DIGNIDAD NACIONAL                                                                                   ","02","01","01","06","0201","000002309 - DIGNIDAD NACIONAL                                                                                   ",null,null,null,null,null,"09","18","UNION ASHANINKA","0918","0918 - UNION ASHANINKA"]
[null,null,null,null,null,null,null,null,null,null,null,null,null,null,"000002313","OCCOPATA                                                                                            ","02","01","01","06","0201","000002313 - OCCOPATA                                                                                            ",null,null,null,null,null,"10","00","(All)","1000","1000 - (All)"]
[null,null,null,null,null,null,null,null,null,null,null,null,null,null,"000010067","ESSALUD-SANTIAGO","02","01","01","06","0201","000010067 - ESSALUD-SANTIAGO",null,null,null,null,null,"10","01","PARURO","1001","1001 - PARURO"]
[null,null,null,null,null,null,null,null,null,null,null,null,null,null,"000010920","EJERCITO-QUINTA BRIGADA DE MONTAÑA","02","01","01","06","0201","000010920 - EJERCITO-QUINTA BRIGADA DE MONTAÑA",null,null,null,null,null,"10","02","ACCHA","1002","1002 - ACCHA"]
[null,null,null,null,null,null,null,null,null,null,null,null,null,null,"000026182","MENTAL SANTIAGO","02","01","01","06","0201","000026182 - MENTAL SANTIAGO",null,null,null,null,null,"10","03","CCAPI","1003","1003 - CCAPI"]
[null,null,null,null,null,null,null,null,null,null,null,null,null,null,"000000000","(All)","02","02",null,null,"0202","000000000 - (All)",null,null,null,null,null,"10","04","COLCHA","1004","1004 - COLCHA"]
[null,null,null,null,null,null,null,null,null,null,null,null,null,null,"000002302","CCORAO                                                                                              ","02","02","01","05","0202","000002302 - CCORAO                                                                                              ",null,null,null,null,null,"10","05","HUANOQUITE","1005","1005 - HUANOQUITE"]
[null,null,null,null,null,null,null,null,null,null,null,null,null,null,"000002307","MANCO CAPAC","02","02","01","06","0202","000002307 - MANCO CAPAC",null,null,null,null,null,"10","06","OMACHA","1006","1006 - OMACHA"]
[null,null,null,null,null,null,null,null,null,null,null,null,null,null,"000002310","CHOCCO                                                                                              ","02","02","01","06","0202","000002310 - CHOCCO                                                                                              ",null,null,null,null,null,"10","07","PACCARITAMBO","1007","1007 - PACCARITAMBO"]
[null,null,null,null,null,null,null,null,null,null,null,null,null,null,"000002315","WANCHAQ                                                                                             ","02","02","01","08","0202","000002315 - WANCHAQ                                                                                             ",null,null,null,null,null,"10","08","PILLPINTO","1008","1008 - PILLPINTO"]
[null,null,null,null,null,null,null,null,null,null,null,null,null,null,"000002316","TTIO                                                                                                ","02","02","01","08","0202","000002316 - TTIO                                                                                                ",null,null,null,null,null,"10","09","YAURISQUE","1009","1009 - YAURISQUE"]
[null,null,null,null,null,null,null,null,null,null,null,null,null,null,"000010041","ESSALUD-ADOLFO GUEVARA V.","02","02","01","08","0202","000010041 - ESSALUD-ADOLFO GUEVARA V.",null,null,null,null,null,"11","00","(All)","1100","1100 - (All)"]
[null,null,null,null,null,null,null,null,null,null,null,null,null,null,"000026183","ESSALUD-METROPOLITANO","02","02","01","08","0202","000026183 - ESSALUD-METROPOLITANO",null,null,null,null,null,"11","01","PAUCARTAMBO","1101","1101 - PAUCARTAMBO"]
[null,null,null,null,null,null,null,null,null,null,null,null,null,null,"000030730","PATRON SANTIAGO","02","02","01","08","0202","000030730 - PATRON SANTIAGO",null,null,null,null,null,"11","02","CAICAY","1102","1102 - CAICAY"]
[null,null,null,null,null,null,null,null,null,null,null,null,null,null,"000034419","MENTAL COMUNITARIO CUSCO","02","02","01","08","0202","000034419 - MENTAL COMUNITARIO CUSCO",null,null,null,null,null,"11","03","CHALLABAMBA","1103","1103 - CHALLABAMBA"]
[null,null,null,null,null,null,null,null,null,null,null,null,null,null,"000000000","(All)","02","03",null,null,"0203","000000000 - (All)",null,null,null,null,null,"11","04","COLQUEPATA","1104","1104 - COLQUEPATA"]
[null,null,null,null,null,null,null,null,null,null,null,null,null,null,"000002326","ANTA                                                                                                ","02","03","03","01","0203","000002326 - ANTA                                                                                                ",null,null,null,null,null,"11","05","HUANCARANI","1105","1105 - HUANCARANI"]
[null,null,null,null,null,null,null,null,null,null,null,null,null,null,"000002327","CHACAN                                                                                              ","02","03","03","01","0203","000002327 - CHACAN                                                                                              ",null,null,null,null,null,"11","06","KOSÑIPATA","1106","1106 - KOSÑIPATA"]
[null,null,null,null,null,null,null,null,null,null,null,null,null,null,"000002328","COMPONE                                                                                             ","02","03","03","01","0203","000002328 - COMPONE                                                                                             ",null,null,null,null,null,"12","00","(All)","1200","1200 - (All)"]
[null,null,null,null,null,null,null,null,null,null,null,null,null,null,"000002329","CONCHACALLA                                                                                         ","02","03","03","01","0203","000002329 - CONCHACALLA                                                                                         ",null,null,null,null,null,"12","01","URCOS","1201","1201 - URCOS"]
[null,null,null,null,null,null,null,null,null,null,null,null,null,null,"000002330","ANCAHUASI                                                                                           ","02","03","03","02","0203","000002330 - ANCAHUASI                                                                                           ",null,null,null,null,null,"12","02","ANDAHUAYLILLAS","1202","1202 - ANDAHUAYLILLAS"]
[null,null,null,null,null,null,null,null,null,null,null,null,null,null,"000002331","CACHIMAYO                                                                                           ","02","03","03","03","0203","000002331 - CACHIMAYO                                                                                           ",null,null,null,null,null,"12","03","CAMANTI","1203","1203 - CAMANTI"]
[null,null,null,null,null,null,null,null,null,null,null,null,null,null,"000002332","CHINCHAYPUJIO                                                                                       ","02","03","03","04","0203","000002332 - CHINCHAYPUJIO                                                                                       ",null,null,null,null,null,"12","04","CCARHUAYO","1204","1204 - CCARHUAYO"]
[null,null,null,null,null,null,null,null,null,null,null,null,null,null,"000002333","HUAROCONDO                                                                                          ","02","03","03","05","0203","000002333 - HUAROCONDO                                                                                          ",null,null,null,null,null,"12","05","CCATCA","1205","1205 - CCATCA"]
[null,null,null,null,null,null,null,null,null,null,null,null,null,null,"000002334","HUAYLLACOCHA                                                                                        ","02","03","03","05","0203","000002334 - HUAYLLACOCHA                                                                                        ",null,null,null,null,null,"12","06","CUSIPATA","1206","1206 - CUSIPATA"]
[null,null,null,null,null,null,null,null,null,null,null,null,null,null,"000002339","PUCYURA ANTA                                                                                        ","02","03","03","08","0203","000002339 - PUCYURA ANTA                                                                                        ",null,null,null,null,null,"12","07","HUARO","1207","1207 - HUARO"]
[null,null,null,null,null,null,null,null,null,null,null,null,null,null,"000002340","ZURITE                                                                                              ","02","03","03","09","0203","000002340 - ZURITE                                                                                              ",null,null,null,null,null,"12","08","LUCRE","1208","1208 - LUCRE"]
[null,null,null,null,null,null,null,null,null,null,null,null,null,null,"000006972","PANTIPATA                                                                                           ","02","03","03","04","0203","000006972 - PANTIPATA                                                                                           ",null,null,null,null,null,"12","09","MARCAPATA","1209","1209 - MARCAPATA"]
[null,null,null,null,null,null,null,null,null,null,null,null,null,null,"000027790","MENTAL COMUNITARIO ANTA","02","03","03","01","0203","000027790 - MENTAL COMUNITARIO ANTA",null,null,null,null,null,"12","10","OCONGATE","1210","1210 - OCONGATE"]
[null,null,null,null,null,null,null,null,null,null,null,null,null,null,"000000000","(All)","02","04",null,null,"0204","000000000 - (All)",null,null,null,null,null,"12","11","OROPESA","1211","1211 - OROPESA"]
[null,null,null,null,null,null,null,null,null,null,null,null,null,null,"000002336","LIMATAMBO                                                                                           ","02","04","03","06","0204","000002336 - LIMATAMBO                                                                                           ",null,null,null,null,null,"12","12","QUIQUIJANA","1212","1212 - QUIQUIJANA"]
[null,null,null,null,null,null,null,null,null,null,null,null,null,null,"000002337","PAMPACONGA                                                                                          ","02","04","03","06","0204","000002337 - PAMPACONGA                                                                                          ",null,null,null,null,null,"13","00","(All)","1300","1300 - (All)"]
[null,null,null,null,null,null,null,null,null,null,null,null,null,null,"000002338","MOLLEPATA                                                                                           ","02","04","03","07","0204","000002338 - MOLLEPATA                                                                                           ",null,null,null,null,null,"13","01","URUBAMBA","1301","1301 - URUBAMBA"]
[null,null,null,null,null,null,null,null,null,null,null,null,null,null,"000010761","URATARI                                                                                             ","02","04","03","06","0204","000010761 - URATARI                                                                                             ",null,null,null,null,null,"13","02","CHINCHERO","1302","1302 - CHINCHERO"]
[null,null,null,null,null,null,null,null,null,null,null,null,null,null,"000021061","HUAMANPATA                                                                                          ","02","04","03","07","0204","000021061 - HUAMANPATA                                                                                          ",null,null,null,null,null,"13","03","HUAYLLABAMBA","1303","1303 - HUAYLLABAMBA"]
[null,null,null,null,null,null,null,null,null,null,null,null,null,null,"000000000","(All)","02","05",null,null,"0205","000000000 - (All)",null,null,null,null,null,"13","04","MACHUPICCHU","1304","1304 - MACHUPICCHU"]
[null,null,null,null,null,null,null,null,null,null,null,null,null,null,"000002343","COYA                                                                                                ","02","05","04","02","0205","000002343 - COYA                                                                                                ",null,null,null,null,null,"13","05","MARAS","1305","1305 - MARAS"]
[null,null,null,null,null,null,null,null,null,null,null,null,null,null,"000002344","LAMAY                                                                                               ","02","05","04","03","0205","000002344 - LAMAY                                                                                               ",null,null,null,null,null,"13","06","OLLANTAYTAMBO","1306","1306 - OLLANTAYTAMBO"]
[null,null,null,null,null,null,null,null,null,null,null,null,null,null,"000002348","PISAC                                                                                               ","02","05","04","05","0205","000002348 - PISAC                                                                                               ",null,null,null,null,null,"13","07","YUCAY","1307","1307 - YUCAY"]
[null,null,null,null,null,null,null,null,null,null,null,null,null,null,"000002349","CUYO CHICO                                                                                          ","02","05","04","05","0205",{"$f":"CONCATENATE(O139,\" - \",P139)","v":"000002349 - CUYO CHICO                                                                                          "},null,null,null,null,null,"00","00","(All)",{"$f":"CONCATENATE(AB139,AC139)","v":"0000"},{"$f":"CONCATENATE(AB139,AC139,\" - \",AD139)","v":"0000 - (All)"}]
[null,null,null,null,null,null,null,null,null,null,null,null,null,null,"000002350","CUYO GRANDE                                                                                         ","02","05","04","05","0205","000002350 - CUYO GRANDE                                                                                         "]
[null,null,null,null,null,null,null,null,null,null,null,null,null,null,"000002351","QUELLO QUELLO                                                                                       ","02","05","04","05","0205","000002351 - QUELLO QUELLO                                                                                       "]
[null,null,null,null,null,null,null,null,null,null,null,null,null,null,"000002352","SAN SALVADOR                                                                                        ","02","05","04","06","0205","000002352 - SAN SALVADOR                                                                                        "]
[null,null,null,null,null,null,null,null,null,null,null,null,null,null,"000002353","TARAY                                                                                               ","02","05","04","07","0205","000002353 - TARAY                                                                                               "]
[null,null,null,null,null,null,null,null,null,null,null,null,null,null,"000002354","HUANCALLE                                                                                           ","02","05","04","07","0205","000002354 - HUANCALLE                                                                                           "]
[null,null,null,null,null,null,null,null,null,null,null,null,null,null,"000006970","TIRACANCHA                                                                                          ","02","05","04","06","0205","000006970 - TIRACANCHA                                                                                          "]
[null,null,null,null,null,null,null,null,null,null,null,null,null,null,"000006975","SAYLLAFAYA                                                                                          ","02","05","04","03","0205","000006975 - SAYLLAFAYA                                                                                          "]
[null,null,null,null,null,null,null,null,null,null,null,null,null,null,"000007145","HUAMA                                                                                               ","02","05","04","03","0205","000007145 - HUAMA                                                                                               "]
[null,null,null,null,null,null,null,null,null,null,null,null,null,null,"000007146","POQUES                                                                                              ","02","05","04","03","0205","000007146 - POQUES                                                                                              "]
[null,null,null,null,null,null,null,null,null,null,null,null,null,null,"000025368","HUARQUI","02","05","04","03","0205","000025368 - HUARQUI"]
[null,null,null,null,null,null,null,null,null,null,null,null,null,null,"000000000","(All)","02","06",null,null,"0206","000000000 - (All)"]
[null,null,null,null,null,null,null,null,null,null,null,null,null,null,"000002341","CALCA                                                                                               ","02","06","04","01","0206","000002341 - CALCA                                                                                               "]
[null,null,null,null,null,null,null,null,null,null,null,null,null,null,"000002342","AMPARAES                                                                                            ","02","06","04","04","0206","000002342 - AMPARAES                                                                                            "]
[null,null,null,null,null,null,null,null,null,null,null,null,null,null,"000002345","CCACHIN                                                                                             ","02","06","04","04","0206","000002345 - CCACHIN                                                                                             "]
[null,null,null,null,null,null,null,null,null,null,null,null,null,null,"000002346","CHOQUECANCHA                                                                                        ","02","06","04","04",{"$f":"CONCATENATE(Q154,R154)","v":"0206"},"000002346 - CHOQUECANCHA                                                                                        "]
[null,null,null,null,null,null,null,null,null,null,null,null,null,null,"000002347","LARES                                                                                               ","02","06","04","04","0206","000002347 - LARES                                                                                               "]
[null,null,null,null,null,null,null,null,null,null,null,null,null,null,"000002361","SUYO                                                                                                ","02","06","04","04","0206","000002361 - SUYO                                                                                                "]
[null,null,null,null,null,null,null,null,null,null,null,null,null,null,"000002515","PAROBAMBA                                                                                           ","02","06",11,"03","0206","000002515 - PAROBAMBA                                                                                           "]
[null,null,null,null,null,null,null,null,null,null,null,null,null,null,"000007143","OTOCANI                                                                                             ","02","06",11,"03","0206","000007143 - OTOCANI                                                                                             "]
[null,null,null,null,null,null,null,null,null,null,null,null,null,null,"000007144","PATABAMBA                                                                                           ","02","06","04","07","0206","000007144 - PATABAMBA                                                                                           "]
[null,null,null,null,null,null,null,null,null,null,null,null,null,null,"000010069","ESSALUD-CALCA","02","06","04","01","0206","000010069 - ESSALUD-CALCA"]
[null,null,null,null,null,null,null,null,null,null,null,null,null,null,"000010759","HUARAN                                                                                              ","02","06","04","01","0206","000010759 - HUARAN                                                                                              "]
[null,null,null,null,null,null,null,null,null,null,null,null,null,null,"000010762","ACCHA ALTA - PAMPALLACTA                                                                            ","02","06","04","01","0206","000010762 - ACCHA ALTA - PAMPALLACTA                                                                            "]
[null,null,null,null,null,null,null,null,null,null,null,null,null,null,"000026273","MENTAL COMUNITARIO CALCA","02","06","04","01","0206","000026273 - MENTAL COMUNITARIO CALCA"]
[null,null,null,null,null,null,null,null,null,null,null,null,null,null,"000000000","(All)","02","07",null,null,"0207","000000000 - (All)"]
[null,null,null,null,null,null,null,null,null,null,null,null,null,null,"000002540","URUBAMBA                                                                                            ","02","07",13,"01","0207","000002540 - URUBAMBA                                                                                            "]
[null,null,null,null,null,null,null,null,null,null,null,null,null,null,"000002541","YANAHUARA                                                                                           ","02","07",13,"01","0207","000002541 - YANAHUARA                                                                                           "]
[null,null,null,null,null,null,null,null,null,null,null,null,null,null,"000002543","CHINCHERO                                                                                           ","02","07",13,"02","0207","000002543 - CHINCHERO                                                                                           "]
[null,null,null,null,null,null,null,null,null,null,null,null,null,null,"000002544","OCCOTUAN                                                                                            ","02","07",13,"02","0207","000002544 - OCCOTUAN                                                                                            "]
[null,null,null,null,null,null,null,null,null,null,null,null,null,null,"000002545","HUAYLLABAMBA                                                                                        ","02","07",13,"03","0207","000002545 - HUAYLLABAMBA                                                                                        "]
[null,null,null,null,null,null,null,null,null,null,null,null,null,null,"000002546","MACHUPICCHU                                                                                         ","02","07",13,"04","0207","000002546 - MACHUPICCHU                                                                                         "]
[null,null,null,null,null,null,null,null,null,null,null,null,null,null,"000002547","COLLPANI                                                                                            ","02","07",13,"04","0207","000002547 - COLLPANI                                                                                            "]
[null,null,null,null,null,null,null,null,null,null,null,null,null,null,"000002548","MARAS                                                                                               ","02","07",13,"05","0207","000002548 - MARAS                                                                                               "]
[null,null,null,null,null,null,null,null,null,null,null,null,null,null,"000002549","OLLANTAYTAMBO                                                                                       ","02","07",13,"06","0207","000002549 - OLLANTAYTAMBO                                                                                       "]
[null,null,null,null,null,null,null,null,null,null,null,null,null,null,"000002550","CHILLCA                                                                                            ","02","07",13,"06","0207","000002550 - CHILLCA                                                                                            "]
[null,null,null,null,null,null,null,null,null,null,null,null,null,null,"000002551","YUCAY                                                                                               ","02","07",13,"07","0207","000002551 - YUCAY                                                                                               "]
[null,null,null,null,null,null,null,null,null,null,null,null,null,null,"000006974","CAMINO INCA HUAYLLABAMBA                                                                            ","02","07",13,"04","0207","000006974 - CAMINO INCA HUAYLLABAMBA                                                                            "]
[null,null,null,null,null,null,null,null,null,null,null,null,null,null,"000010060","ESSALUD-URUBAMBA","02","07",13,"01","0207","000010060 - ESSALUD-URUBAMBA"]
[null,null,null,null,null,null,null,null,null,null,null,null,null,null,"000010073","ESSALUD-MACHU PICCHU","02","07",13,"04","0207","000010073 - ESSALUD-MACHU PICCHU"]
[null,null,null,null,null,null,null,null,null,null,null,null,null,null,"000010758","CRUZPATA                                                                                            ","02","07",13,"05","0207","000010758 - CRUZPATA                                                                                            "]
[null,null,null,null,null,null,null,null,null,null,null,null,null,null,"000010760","PATACANCHA                                                                                          ","02","07",13,"06","0207","000010760 - PATACANCHA                                                                                          "]
[null,null,null,null,null,null,null,null,null,null,null,null,null,null,"000030666","MENTAL COMUNITARIO URUBAMBA","02","07",13,"01","0207","000030666 - MENTAL COMUNITARIO URUBAMBA"]
[null,null,null,null,null,null,null,null,null,null,null,null,null,null,"000000000","(All)","02","08",null,null,"0208","000000000 - (All)"]
[null,null,null,null,null,null,null,null,null,null,null,null,null,null,"000002355","LA QUEBRADA                                                                                         ","02","08","04","08","0208","000002355 - LA QUEBRADA                                                                                         "]
[null,null,null,null,null,null,null,null,null,null,null,null,null,null,"000002356","CCORIMAYO                                                                                           ","02","08","04","08","0208","000002356 - CCORIMAYO                                                                                           "]
[null,null,null,null,null,null,null,null,null,null,null,null,null,null,"000002357","COLCCA YANATILE                                                                                     ","02","08","04","08","0208","000002357 - COLCCA YANATILE                                                                                     "]
[null,null,null,null,null,null,null,null,null,null,null,null,null,null,"000002358","MUYUPAY                                                                                             ","02","08","04","08","0208","000002358 - MUYUPAY                                                                                             "]
[null,null,null,null,null,null,null,null,null,null,null,null,null,null,"000002359","PUTUCUSI                                                                                            ","02","08","04","08","0208","000002359 - PUTUCUSI                                                                                            "]
[null,null,null,null,null,null,null,null,null,null,null,null,null,null,"000002360","QUESQUENTO                                                                                          ","02","08","04","08","0208","000002360 - QUESQUENTO                                                                                          "]
[null,null,null,null,null,null,null,null,null,null,null,null,null,null,"000002362","HUACHIBAMBA                                                                                         ","02","08","04","08","0208","000002362 - HUACHIBAMBA                                                                                         "]
[null,null,null,null,null,null,null,null,null,null,null,null,null,null,"000002464","VERSALLES                                                                                           ","02","08","09","05","0208","000002464 - VERSALLES                                                                                           "]
[null,null,null,null,null,null,null,null,null,null,null,null,null,null,"000002467","PUENTE SANTIAGO                                                                                     ","02","08","09","06","0208","000002467 - PUENTE SANTIAGO                                                                                     "]
[null,null,null,null,null,null,null,null,null,null,null,null,null,null,"000006971","COMBAPATA YANATILE                                                                                  ","02","08","04","08","0208","000006971 - COMBAPATA YANATILE                                                                                  "]
[null,null,null,null,null,null,null,null,null,null,null,null,null,null,"000006973","BELLAVISTA                                                                                          ","02","08","04","08","0208","000006973 - BELLAVISTA                                                                                          "]
[null,null,null,null,null,null,null,null,null,null,null,null,null,null,"000007142","CHANCAMAYO                                                                                          ","02","08","04","08","0208","000007142 - CHANCAMAYO                                                                                          "]
[null,null,null,null,null,null,null,null,null,null,null,null,null,null,"000000000","(All)","02","09",null,null,"0209","000000000 - (All)"]
[null,null,null,null,null,null,null,null,null,null,null,null,null,null,"000002290","SAN PEDRO CUSCO                                                                                     ","02","09","01","01","0209","000002290 - SAN PEDRO CUSCO                                                                                     "]
[null,null,null,null,null,null,null,null,null,null,null,null,null,null,"000002291","SIETE CUARTONES                                                                                     ","02","09","01","01","0209","000002291 - SIETE CUARTONES                                                                                     "]
[null,null,null,null,null,null,null,null,null,null,null,null,null,null,"000002293","MIRAFLORES                                                                                          ","02","09","01","01","0209","000002293 - MIRAFLORES                                                                                          "]
[null,null,null,null,null,null,null,null,null,null,null,null,null,null,"000002294","PICCHU LA RINCONADA                                                                                 ","02","09","01","01","0209","000002294 - PICCHU LA RINCONADA                                                                                 "]
[null,null,null,null,null,null,null,null,null,null,null,null,null,null,"000002295","BUENA VISTA                                                                                         ","02","09","01","01","0209","000002295 - BUENA VISTA                                                                                         "]
[null,null,null,null,null,null,null,null,null,null,null,null,null,null,"000002299","POROY                                                                                               ","02","09","01","03","0209","000002299 - POROY                                                                                               "]
[null,null,null,null,null,null,null,null,null,null,null,null,null,null,"999999999","(All)","02","99",null,null,"0299","999999999 - (All)"]
[null,null,null,null,null,null,null,null,null,null,null,null,null,null,"000002421","HOSPITAL QUILLABAMBA","03","00","09","01",{"$f":"CONCATENATE(Q203,R203)","v":"0300"},{"$f":"CONCATENATE(O203,\" - \",P203)","v":"000002421 - HOSPITAL QUILLABAMBA"}]
[null,null,null,null,null,null,null,null,null,null,null,null,null,null,"000000000","(All)","03","01",null,null,{"$f":"CONCATENATE(Q204,R204)","v":"0301"},{"$f":"CONCATENATE(O204,\" - \",P204)","v":"000000000 - (All)"}]
[null,null,null,null,null,null,null,null,null,null,null,null,null,null,"000002422","HUAYANAY                                                                                            ","03","01","09","01",{"$f":"CONCATENATE(Q205,R205)","v":"0301"},{"$f":"CONCATENATE(O205,\" - \",P205)","v":"000002422 - HUAYANAY                                                                                            "}]
[null,null,null,null,null,null,null,null,null,null,null,null,null,null,"000002423","IDMA                                                                                                ","03","01","09","01","0301",{"$f":"CONCATENATE(O206,\" - \",P206)","v":"000002423 - IDMA                                                                                                "}]
[null,null,null,null,null,null,null,null,null,null,null,null,null,null,"000002424","POTRERO                                                                                             ","03","01","09","01","0301",{"$f":"CONCATENATE(O207,\" - \",P207)","v":"000002424 - POTRERO                                                                                             "}]
[null,null,null,null,null,null,null,null,null,null,null,null,null,null,"000002425","ECHARATE                                                                                            ","03","01","09","02","0301","000002425 - ECHARATE                                                                                            "]
[null,null,null,null,null,null,null,null,null,null,null,null,null,null,"000002429","CIRIALO                                                                                             ","03","01","09","02","0301","000002429 - CIRIALO                                                                                             "]
[null,null,null,null,null,null,null,null,null,null,null,null,null,null,"000002430","PAMPA CONCEPCION                                                                                    ","03","01","09","02","0301","000002430 - PAMPA CONCEPCION                                                                                    "]
[null,null,null,null,null,null,null,null,null,null,null,null,null,null,"000002433","KORIBENI                                                                                            ","03","01","09","02","0301","000002433 - KORIBENI                                                                                            "]
[null,null,null,null,null,null,null,null,null,null,null,null,null,null,"000002439","PALMA REAL                                                                                          ","03","01","09","02","0301","000002439 - PALMA REAL                                                                                          "]
[null,null,null,null,null,null,null,null,null,null,null,null,null,null,"000002446","CHACCO                                                                                              ","03","01","09","02","0301","000002446 - CHACCO                                                                                              "]
[null,null,null,null,null,null,null,null,null,null,null,null,null,null,"000002449","ICHIQUIATO                                                                                          ","03","01","09","02","0301","000002449 - ICHIQUIATO                                                                                          "]
[null,null,null,null,null,null,null,null,null,null,null,null,null,null,"000002450","SAN ANTONIO                                                                                         ","03","01","09","02","0301","000002450 - SAN ANTONIO                                                                                         "]
[null,null,null,null,null,null,null,null,null,null,null,null,null,null,"000002451","CHAHUARES                                                                                           ","03","01","09","02","0301","000002451 - CHAHUARES                                                                                           "]
[null,null,null,null,null,null,null,null,null,null,null,null,null,null,"000008910","SANTA ANA                                                                                           ","03","01","09","01","0301","000008910 - SANTA ANA                                                                                           "]
[null,null,null,null,null,null,null,null,null,null,null,null,null,null,"000010062","ESSALUD-QUILLABAMBA","03","01","09","01","0301","000010062 - ESSALUD-QUILLABAMBA"]
[null,null,null,null,null,null,null,null,null,null,null,null,null,null,"000011744","SANIDAD-QUILLABAMBA PNP","03","01","09","01","0301","000011744 - SANIDAD-QUILLABAMBA PNP"]
[null,null,null,null,null,null,null,null,null,null,null,null,null,null,"000015842","PAVAYOC                                                                                             ","03","01","09","01","0301","000015842 - PAVAYOC                                                                                             "]
[null,null,null,null,null,null,null,null,null,null,null,null,null,null,"000023721","EJERCITO-PERUANO","03","01","09","01","0301","000023721 - EJERCITO-PERUANO"]
[null,null,null,null,null,null,null,null,null,null,null,null,null,null,"000026386","MENTAL QUILLABAMBA","03","01","09","01","0301","000026386 - MENTAL QUILLABAMBA"]
[null,null,null,null,null,null,null,null,null,null,null,null,null,null,"000033273","SAN ISIDRO LABRADOR - ECHARATI","03","01","09","02","0301","000033273 - SAN ISIDRO LABRADOR - ECHARATI"]
[null,null,null,null,null,null,null,null,null,null,null,null,null,null,"000000000","(All)","03","02",null,null,"0302","000000000 - (All)"]
[null,null,null,null,null,null,null,null,null,null,null,null,null,null,"000002453","HUYRO                                                                                               ","03","02","09","03","0302","000002453 - HUYRO                                                                                               "]
[null,null,null,null,null,null,null,null,null,null,null,null,null,null,"000002454","ALFAMAYO                                                                                            ","03","02","09","03","0302","000002454 - ALFAMAYO                                                                                            "]
[null,null,null,null,null,null,null,null,null,null,null,null,null,null,"000002455","HUAYOPATA                                                                                           ","03","02","09","03","0302","000002455 - HUAYOPATA                                                                                           "]
[null,null,null,null,null,null,null,null,null,null,null,null,null,null,"000002456","AMAYBAMBA                                                                                           ","03","02","09","03","0302","000002456 - AMAYBAMBA                                                                                           "]
[null,null,null,null,null,null,null,null,null,null,null,null,null,null,"000002457","SAN PABLO HUAYOPATA                                                                                 ","03","02","09","03","0302","000002457 - SAN PABLO HUAYOPATA                                                                                 "]
[null,null,null,null,null,null,null,null,null,null,null,null,null,null,"000002458","MARANURA                                                                                            ","03","02","09","04","0302","000002458 - MARANURA                                                                                            "]
[null,null,null,null,null,null,null,null,null,null,null,null,null,null,"000002460","SANTA MARIA                                                                                         ","03","02","09","04","0302","000002460 - SANTA MARIA                                                                                         "]
[null,null,null,null,null,null,null,null,null,null,null,null,null,null,"000002461","UCHUMAYO                                                                                            ","03","02","09","04","0302","000002461 - UCHUMAYO                                                                                            "]
[null,null,null,null,null,null,null,null,null,null,null,null,null,null,"000002476","SANTA TERESA                                                                                        ","03","02","09","08","0302","000002476 - SANTA TERESA                                                                                        "]
[null,null,null,null,null,null,null,null,null,null,null,null,null,null,"000002477","SULLUCUYOC                                                                                          ","03","02","09","08","0302","000002477 - SULLUCUYOC                                                                                          "]
[null,null,null,null,null,null,null,null,null,null,null,null,null,null,"000002478","TOTORA                                                                                              ","03","02","09","08","0302","000002478 - TOTORA                                                                                              "]
[null,null,null,null,null,null,null,null,null,null,null,null,null,null,"000010075","ESSALUD-HUYRO","03","02","09","03","0302","000010075 - ESSALUD-HUYRO"]
[null,null,null,null,null,null,null,null,null,null,null,null,null,null,"000000000","(All)","03","03",null,null,"0303","000000000 - (All)"]
[null,null,null,null,null,null,null,null,null,null,null,null,null,null,"000002363","TUPAC AMARU QUELLOUNO                                                                               ","03","03","04","08","0303","000002363 - TUPAC AMARU QUELLOUNO                                                                               "]
[null,null,null,null,null,null,null,null,null,null,null,null,null,null,"000002462","OCCOBAMBA LACONVENCION                                                                              ","03","03","09","05","0303","000002462 - OCCOBAMBA LACONVENCION                                                                              "]
[null,null,null,null,null,null,null,null,null,null,null,null,null,null,"000002463","CHINGANILLA                                                                                         ","03","03","09","05","0303","000002463 - CHINGANILLA                                                                                         "]
[null,null,null,null,null,null,null,null,null,null,null,null,null,null,"000002465","QUELLOUNO                                                                                           ","03","03","09","06","0303","000002465 - QUELLOUNO                                                                                           "]
[null,null,null,null,null,null,null,null,null,null,null,null,null,null,"000002466","HUILLCAPAMPA                                                                                        ","03","03","09","06","0303","000002466 - HUILLCAPAMPA                                                                                        "]
[null,null,null,null,null,null,null,null,null,null,null,null,null,null,"000002468","SAN MARTIN                                                                                          ","03","03","09","06","0303","000002468 - SAN MARTIN                                                                                          "]
[null,null,null,null,null,null,null,null,null,null,null,null,null,null,"000008906","ESTRELLA                                                                                            ","03","03","09","06","0303","000008906 - ESTRELLA                                                                                            "]
[null,null,null,null,null,null,null,null,null,null,null,null,null,null,"000008907","MATORIATO                                                                                           ","03","03","09","06","0303","000008907 - MATORIATO                                                                                           "]
[null,null,null,null,null,null,null,null,null,null,null,null,null,null,"000008908","CHIRUMBIA                                                                                           ","03","03","09","06","0303","000008908 - CHIRUMBIA                                                                                           "]
[null,null,null,null,null,null,null,null,null,null,null,null,null,null,"000008909","CHAPO BOYERO                                                                                        ","03","03","09","06","0303","000008909 - CHAPO BOYERO                                                                                        "]
[null,null,null,null,null,null,null,null,null,null,null,null,null,null,"000000000","(All)","03","04",null,null,"0304","000000000 - (All)"]
[null,null,null,null,null,null,null,null,null,null,null,null,null,null,"000002427","KITENI                                                                                              ","03","04","09","02","0304","000002427 - KITENI                                                                                              "]
[null,null,null,null,null,null,null,null,null,null,null,null,null,null,"000002431","IVOCHOTE                                                                                            ","03","04","09","02","0304","000002431 - IVOCHOTE                                                                                            "]
[null,null,null,null,null,null,null,null,null,null,null,null,null,null,"000002432","KEPASHIATO                                                                                          ","03","04","09","15","0304","000002432 - KEPASHIATO                                                                                          "]
[null,null,null,null,null,null,null,null,null,null,null,null,null,null,"000002434","MATERIATO                                                                                           ","03","04","09","15","0304","000002434 - MATERIATO                                                                                           "]
[null,null,null,null,null,null,null,null,null,null,null,null,null,null,"000002438","PACHIRI                                                                                             ","03","04","09","02","0304","000002438 - PACHIRI                                                                                             "]
[null,null,null,null,null,null,null,null,null,null,null,null,null,null,"000002440","PANGOA                                                                                              ","03","04","09","02","0304","000002440 - PANGOA                                                                                              "]
[null,null,null,null,null,null,null,null,null,null,null,null,null,null,"000002443","SANIRIATO                                                                                           ","03","04","09","02","0304","000002443 - SANIRIATO                                                                                           "]
[null,null,null,null,null,null,null,null,null,null,null,null,null,null,"000002447","KAMANQUIRIATO                                                                                       ","03","04","09","02","0304","000002447 - KAMANQUIRIATO                                                                                       "]
[null,null,null,null,null,null,null,null,null,null,null,null,null,null,"000002489","YUVENI                                                                                              ","03","04","09","09","0304","000002489 - YUVENI                                                                                              "]
[null,null,null,null,null,null,null,null,null,null,null,null,null,null,"000002493","SELVA ALEGRE                                                                                        ","03","04","09","09","0304","000002493 - SELVA ALEGRE                                                                                        "]
[null,null,null,null,null,null,null,null,null,null,null,null,null,null,"000006976","CHONTABAMBA                                                                                         ","03","04","09","09","0304","000006976 - CHONTABAMBA                                                                                         "]
[null,null,null,null,null,null,null,null,null,null,null,null,null,null,"000013068","TRIO RIO                                                                                            ","03","04","09","15","0304","000013068 - TRIO RIO                                                                                            "]
[null,null,null,null,null,null,null,null,null,null,null,null,null,null,"000013069","PUGUIENTIMARI                                                                                       ","03","04","09","15","0304","000013069 - PUGUIENTIMARI                                                                                       "]
[null,null,null,null,null,null,null,null,null,null,null,null,null,null,"000014531","ESSALUD-ECHARATE/KITENI","03","04","09","02","0304","000014531 - ESSALUD-ECHARATE/KITENI"]
[null,null,null,null,null,null,null,null,null,null,null,null,null,null,"000024583","EJERCITO-KEPASHIATO 314","03","04","09","02","0304","000024583 - EJERCITO-KEPASHIATO 314"]
[null,null,null,null,null,null,null,null,null,null,null,null,null,null,"000024296","EJERCITO-MIARIA 334","03","04","09","02","0304","000024296 - EJERCITO-MIARIA 334"]
[null,null,null,null,null,null,null,null,null,null,null,null,null,null,"000000000","(All)","03","05",null,null,"0305","000000000 - (All)"]
[null,null,null,null,null,null,null,null,null,null,null,null,null,null,"000002426","KIRIGUETI                                                                                           ","03","05","09","14","0305","000002426 - KIRIGUETI                                                                                           "]
[null,null,null,null,null,null,null,null,null,null,null,null,null,null,"000002428","CHOCORIARI                                                                                          ","03","05","09","14","0305","000002428 - CHOCORIARI                                                                                          "]
[null,null,null,null,null,null,null,null,null,null,null,null,null,null,"000002435","MIARIA                                                                                              ","03","05","09","14","0305","000002435 - MIARIA                                                                                              "]
[null,null,null,null,null,null,null,null,null,null,null,null,null,null,"000002436","NUEVA LUZ                                                                                           ","03","05","09","14",{"$f":"CONCATENATE(Q269,R269)","v":"0305"},"000002436 - NUEVA LUZ                                                                                           "]
[null,null,null,null,null,null,null,null,null,null,null,null,null,null,"000002437","NUEVO MUNDO                                                                                         ","03","05","09","14","0305","000002437 - NUEVO MUNDO                                                                                         "]
[null,null,null,null,null,null,null,null,null,null,null,null,null,null,"000002441","PUERTO HUALLANA                                                                                     ","03","05","09","14","0305",{"$f":"CONCATENATE(O271,\" - \",P271)","v":"000002441 - PUERTO HUALLANA                                                                                     "}]
[null,null,null,null,null,null,null,null,null,null,null,null,null,null,"000002442","PUERTO RICO                                                                                         ","03","05","09","14","0305","000002442 - PUERTO RICO                                                                                         "]
[null,null,null,null,null,null,null,null,null,null,null,null,null,null,"000002444","SENSA                                                                                               ","03","05","09","14","0305","000002444 - SENSA                                                                                               "]
[null,null,null,null,null,null,null,null,null,null,null,null,null,null,"000002445","TIMPIA                                                                                              ","03","05","09","14","0305","000002445 - TIMPIA                                                                                              "]
[null,null,null,null,null,null,null,null,null,null,null,null,null,null,"000002448","KAMISEA                                                                                             ","03","05","09","14","0305","000002448 - KAMISEA                                                                                             "]
[null,null,null,null,null,null,null,null,null,null,null,null,null,null,"000002452","SHIVANKORENI                                                                                        ","03","05","09","14","0305","000002452 - SHIVANKORENI                                                                                        "]
[null,null,null,null,null,null,null,null,null,null,null,null,null,null,"000013066","MONTETONI                                                                                           ","03","05","09","14","0305","000013066 - MONTETONI                                                                                           "]
[null,null,null,null,null,null,null,null,null,null,null,null,null,null,"000013067","TANGOSHIARI                                                                                         ","03","05","09","14","0305","000013067 - TANGOSHIARI                                                                                         "]
[null,null,null,null,null,null,null,null,null,null,null,null,null,null,"000015235","NUEVA VIDA                                                                                          ","03","05","09","14","0305","000015235 - NUEVA VIDA                                                                                          "]
[null,null,null,null,null,null,null,null,null,null,null,null,null,null,"000015843","CASHIRIARI                                                                                          ","03","05","09","14","0305","000015843 - CASHIRIARI                                                                                          "]
[null,null,null,null,null,null,null,null,null,null,null,null,null,null,"000015844","CAMANA                                                                                              ","03","05","09","14","0305","000015844 - CAMANA                                                                                              "]
[null,null,null,null,null,null,null,null,null,null,null,null,null,null,"000000000","(All)","03","06",null,null,"0306","000000000 - (All)"]
[null,null,null,null,null,null,null,null,null,null,null,null,null,null,"000002480","PUCYURA                                                                                             ","03","06","09","09","0306","000002480 - PUCYURA                                                                                             "]
[null,null,null,null,null,null,null,null,null,null,null,null,null,null,"000002481","CCARCCO                                                                                             ","03","06","09",11,"0306","000002481 - CCARCCO                                                                                             "]
[null,null,null,null,null,null,null,null,null,null,null,null,null,null,"000002482","INCAHUASI                                                                                           ","03","06","09",11,"0306","000002482 - INCAHUASI                                                                                           "]
[null,null,null,null,null,null,null,null,null,null,null,null,null,null,"000002484","OYARA                                                                                               ","03","06","09","09","0306","000002484 - OYARA                                                                                               "]
[null,null,null,null,null,null,null,null,null,null,null,null,null,null,"000002485","PACCAYBAMBA                                                                                         ","03","06","09",11,"0306","000002485 - PACCAYBAMBA                                                                                         "]
[null,null,null,null,null,null,null,null,null,null,null,null,null,null,"000002486","PAMPACONAS                                                                                          ","03","06","09","09","0306","000002486 - PAMPACONAS                                                                                          "]
[null,null,null,null,null,null,null,null,null,null,null,null,null,null,"000002487","CHOQUETIRA                                                                                          ","03","06","09",11,"0306","000002487 - CHOQUETIRA                                                                                          "]
[null,null,null,null,null,null,null,null,null,null,null,null,null,null,"000002490","ARMA                                                                                                ","03","06","09","09","0306","000002490 - ARMA                                                                                                "]
[null,null,null,null,null,null,null,null,null,null,null,null,null,null,"000002491","LUCMAHUAYCO                                                                                         ","03","06","09",11,"0306","000002491 - LUCMAHUAYCO                                                                                         "]
[null,null,null,null,null,null,null,null,null,null,null,null,null,null,"000002492","PALTAYBAMBA                                                                                         ","03","06","09","09","0306","000002492 - PALTAYBAMBA                                                                                         "]
[null,null,null,null,null,null,null,null,null,null,null,null,null,null,"000013070","CHANCAVINE                                                                                          ","03","06","09",12,"0306","000013070 - CHANCAVINE                                                                                          "]
[null,null,null,null,null,null,null,null,null,null,null,null,null,null,"000024637","EJERCITO-INCAHUASI 331                                                                                       ","03","06","09",11,"0306","000024637 - EJERCITO-INCAHUASI 331                                                                                       "]
[null,null,null,null,null,null,null,null,null,null,null,null,null,null,"999999999","(All)","03","99",null,null,"0399","999999999 - (All)"]
[null,null,null,null,null,null,null,null,null,null,null,null,null,null,"000002378","HOSPITAL SICUANI","04","00","06","01","0400","000002378 - HOSPITAL SICUANI"]
[null,null,null,null,null,null,null,null,null,null,null,null,null,null,"000007135","HOSPITAL ESPINAR","04","00","08","01","0400","000007135 - HOSPITAL ESPINAR"]
[null,null,null,null,null,null,null,null,null,null,null,null,null,null,"000000000","(All)","04","01",null,null,"0401","000000000 - (All)"]
[null,null,null,null,null,null,null,null,null,null,null,null,null,null,"000002364","YANAOCA                                                                                             ","04","01","05","01","0401","000002364 - YANAOCA                                                                                             "]
[null,null,null,null,null,null,null,null,null,null,null,null,null,null,"000002365","PONGOÑA                                                                                             ","04","01","05","01","0401","000002365 - PONGOÑA                                                                                             "]
[null,null,null,null,null,null,null,null,null,null,null,null,null,null,"000002372","PAMPAMARCA                                                                                          ","04","01","05","06","0401","000002372 - PAMPAMARCA                                                                                          "]
[null,null,null,null,null,null,null,null,null,null,null,null,null,null,"000002373","QUEHUE                                                                                              ","04","01","05","07","0401","000002373 - QUEHUE                                                                                              "]
[null,null,null,null,null,null,null,null,null,null,null,null,null,null,"000002374","HUINCHIRI                                                                                           ","04","01","05","07","0401","000002374 - HUINCHIRI                                                                                           "]
[null,null,null,null,null,null,null,null,null,null,null,null,null,null,"000002375","SURIMANA                                                                                            ","04","01","05","08","0401","000002375 - SURIMANA                                                                                            "]
[null,null,null,null,null,null,null,null,null,null,null,null,null,null,"000002376","TUNGASUCA                                                                                           ","04","01","05","08","0401","000002376 - TUNGASUCA                                                                                           "]
[null,null,null,null,null,null,null,null,null,null,null,null,null,null,"000002377","TOCCOCCORI                                                                                          ","04","01","05","08","0401","000002377 - TOCCOCCORI                                                                                          "]
[null,null,null,null,null,null,null,null,null,null,null,null,null,null,"000018241","HAMPATURA                                                                                           ","04","01","05","01","0401","000018241 - HAMPATURA                                                                                           "]
[null,null,null,null,null,null,null,null,null,null,null,null,null,null,"000032339","CCOCHAPATA                                                                                     ","04","01","05","08","0401","000032339 - CCOCHAPATA                                                                                     "]
[null,null,null,null,null,null,null,null,null,null,null,null,null,null,"000034449","CHAUPIBANDA","04","01","05","08","0401","000034449 - CHAUPIBANDA"]
[null,null,null,null,null,null,null,null,null,null,null,null,null,null,"000000000","(All)","04","02",null,null,"0402","000000000 - (All)"]
[null,null,null,null,null,null,null,null,null,null,null,null,null,null,"000002366","CHECCA                                                                                              ","04","02","05","02","0402","000002366 - CHECCA                                                                                              "]
[null,null,null,null,null,null,null,null,null,null,null,null,null,null,"000002367","CHITIBAMBA                                                                                          ","04","02","05","02","0402","000002367 - CHITIBAMBA                                                                                          "]
[null,null,null,null,null,null,null,null,null,null,null,null,null,null,"000007700","EL DESCANSO                                                                                         ","04","02","05","03","0402","000007700 - EL DESCANSO                                                                                         "]
[null,null,null,null,null,null,null,null,null,null,null,null,null,null,"000000000","(All)","04","03",null,null,"0403","000000000 - (All)"]
[null,null,null,null,null,null,null,null,null,null,null,null,null,null,"000002320","MOSOCLLACTA                                                                                         ","04","03","02","04","0403","000002320 - MOSOCLLACTA                                                                                         "]
[null,null,null,null,null,null,null,null,null,null,null,null,null,null,"000002385","CHECACUPE                                                                                           ","04","03","06","02","0403","000002385 - CHECACUPE                                                                                           "]
[null,null,null,null,null,null,null,null,null,null,null,null,null,null,"000002386","COMBAPATA CANCHIS                                                                                   ","04","03","06","03","0403","000002386 - COMBAPATA CANCHIS                                                                                   "]
[null,null,null,null,null,null,null,null,null,null,null,null,null,null,"000002387","CHIARA                                                                                              ","04","03","06","03","0403","000002387 - CHIARA                                                                                              "]
[null,null,null,null,null,null,null,null,null,null,null,null,null,null,"000002392","PITUMARCA                                                                                           ","04","03","06","05","0403","000002392 - PITUMARCA                                                                                           "]
[null,null,null,null,null,null,null,null,null,null,null,null,null,null,"000002397","TINTA                                                                                               ","04","03","06","08","0403","000002397 - TINTA                                                                                               "]
[null,null,null,null,null,null,null,null,null,null,null,null,null,null,"000000000","(All)","04","04",null,null,"0404","000000000 - (All)"]
[null,null,null,null,null,null,null,null,null,null,null,null,null,null,"000002369","LANGUI                                                                                              ","04","04","05","04","0404","000002369 - LANGUI                                                                                              "]
[null,null,null,null,null,null,null,null,null,null,null,null,null,null,"000002370","CONDEVILUYO                                                                                         ","04","04","05","04","0404","000002370 - CONDEVILUYO                                                                                         "]
[null,null,null,null,null,null,null,null,null,null,null,null,null,null,"000002371","LAYO                                                                                                ","04","04","05","05","0404","000002371 - LAYO                                                                                                "]
[null,null,null,null,null,null,null,null,null,null,null,null,null,null,"000002379","HERCCA                                                                                              ","04","04","06","01","0404","000002379 - HERCCA                                                                                              "]
[null,null,null,null,null,null,null,null,null,null,null,null,null,null,"000002380","TECHO OBRERO                                                                                        ","04","04","06","01","0404","000002380 - TECHO OBRERO                                                                                        "]
[null,null,null,null,null,null,null,null,null,null,null,null,null,null,"000002388","MARANGANI                                                                                           ","04","04","06","04","0404","000002388 - MARANGANI                                                                                           "]
[null,null,null,null,null,null,null,null,null,null,null,null,null,null,"000002389","CHECTUYOC                                                                                           ","04","04","06","04","0404","000002389 - CHECTUYOC                                                                                           "]
[null,null,null,null,null,null,null,null,null,null,null,null,null,null,"000002390","CCUYO                                                                                               ","04","04","06","04","0404","000002390 - CCUYO                                                                                               "]
[null,null,null,null,null,null,null,null,null,null,null,null,null,null,"000002391","OCCOBAMBA MARANGANI                                                                                 ","04","04","06","04","0404","000002391 - OCCOBAMBA MARANGANI                                                                                 "]
[null,null,null,null,null,null,null,null,null,null,null,null,null,null,"000010063","ESSALUD-SICUANI","04","04","06","01","0404","000010063 - ESSALUD-SICUANI"]
[null,null,null,null,null,null,null,null,null,null,null,null,null,null,"000024663","SANIDAD-SICUANI PNP","04","04","06","01","0404","000024663 - SANIDAD-SICUANI PNP"]
[null,null,null,null,null,null,null,null,null,null,null,null,null,null,"000000000","(All)","04","05",null,null,{"$f":"CONCATENATE(Q333,R333)","v":"0405"},"000000000 - (All)"]
[null,null,null,null,null,null,null,null,null,null,null,null,null,null,"000002381","QUEHUAR                                                                                             ","04","05","06","01","0405","000002381 - QUEHUAR                                                                                             "]
[null,null,null,null,null,null,null,null,null,null,null,null,null,null,"000002382","UZCUPATA                                                                                            ","04","05","06","01","0405",{"$f":"CONCATENATE(O335,\" - \",P335)","v":"000002382 - UZCUPATA                                                                                            "}]
[null,null,null,null,null,null,null,null,null,null,null,null,null,null,"000002383","LA FLORIDA                                                                                          ","04","05","06","01","0405","000002383 - LA FLORIDA                                                                                          "]
[null,null,null,null,null,null,null,null,null,null,null,null,null,null,"000002384","PAMPAPHALLA                                                                                         ","04","05","06","01","0405","000002384 - PAMPAPHALLA                                                                                         "]
[null,null,null,null,null,null,null,null,null,null,null,null,null,null,"000002393","PHINAYA                                                                                             ","04","05","06","05","0405","000002393 - PHINAYA                                                                                             "]
[null,null,null,null,null,null,null,null,null,null,null,null,null,null,"000002394","SAN PABLO CANCHIS                                                                                   ","04","05","06","06","0405","000002394 - SAN PABLO CANCHIS                                                                                   "]
[null,null,null,null,null,null,null,null,null,null,null,null,null,null,"000002395","SANTA BARBARA                                                                                       ","04","05","06","06","0405","000002395 - SANTA BARBARA                                                                                       "]
[null,null,null,null,null,null,null,null,null,null,null,null,null,null,"000002396","SAN PEDRO CANCHIS                                                                                   ","04","05","06","07","0405","000002396 - SAN PEDRO CANCHIS                                                                                   "]
[null,null,null,null,null,null,null,null,null,null,null,null,null,null,"000026387","MENTAL COMUNITARIO SICUANI","04","05","06","01","0405","000026387 - MENTAL COMUNITARIO SICUANI"]
[null,null,null,null,null,null,null,null,null,null,null,null,null,null,"000000000","(All)","04","06",null,null,"0406","000000000 - (All)"]
[null,null,null,null,null,null,null,null,null,null,null,null,null,null,"000002410","YAURI                                                                                               ","04","06","08","01","0406","000002410 - YAURI                                                                                               "]
[null,null,null,null,null,null,null,null,null,null,null,null,null,null,"000002411","CONDOROMA                                                                                           ","04","06","08","02","0406","000002411 - CONDOROMA                                                                                           "]
[null,null,null,null,null,null,null,null,null,null,null,null,null,null,"000002412","COPORAQUE                                                                                           ","04","06","08","03","0406","000002412 - COPORAQUE                                                                                           "]
[null,null,null,null,null,null,null,null,null,null,null,null,null,null,"000002413","URINSAYA                                                                                            ","04","06","08","03","0406","000002413 - URINSAYA                                                                                            "]
[null,null,null,null,null,null,null,null,null,null,null,null,null,null,"000002414","HUAYHUAHUASI                                                                                        ","04","06","08","03","0406","000002414 - HUAYHUAHUASI                                                                                        "]
[null,null,null,null,null,null,null,null,null,null,null,null,null,null,"000002415","OCCORURO                                                                                            ","04","06","08","04","0406","000002415 - OCCORURO                                                                                            "]
[null,null,null,null,null,null,null,null,null,null,null,null,null,null,"000002416","PALLPATA                                                                                            ","04","06","08","05","0406","000002416 - PALLPATA                                                                                            "]
[null,null,null,null,null,null,null,null,null,null,null,null,null,null,"000002417","PICHIGUA ESPINAR                                                                                    ","04","06","08","06","0406","000002417 - PICHIGUA ESPINAR                                                                                    "]
[null,null,null,null,null,null,null,null,null,null,null,null,null,null,"000002418","SAN MIGUEL                                                                                          ","04","06","08","06","0406","000002418 - SAN MIGUEL                                                                                          "]
[null,null,null,null,null,null,null,null,null,null,null,null,null,null,"000002419","SUYKUTAMBO                                                                                          ","04","06","08","07","0406","000002419 - SUYKUTAMBO                                                                                          "]
[null,null,null,null,null,null,null,null,null,null,null,null,null,null,"000002420","ACCOCUNCA                                                                                           ","04","06","08","08","0406","000002420 - ACCOCUNCA                                                                                           "]
[null,null,null,null,null,null,null,null,null,null,null,null,null,null,"000006745","TINTAYA MARQUIRI                                                                                    ","04","06","08","01","0406","000006745 - TINTAYA MARQUIRI                                                                                    "]
[null,null,null,null,null,null,null,null,null,null,null,null,null,null,"000010061","ESSALUD-ESPINAR","04","06","08","01","0406","000010061 - ESSALUD-ESPINAR"]
[null,null,null,null,null,null,null,null,null,null,null,null,null,null,"000030366","MENTAL COMUNITARIO ESPINAR","04","06","08","01","0406","000030366 - MENTAL COMUNITARIO ESPINAR"]
[null,null,null,null,null,null,null,null,null,null,null,null,null,null,"999999999","(All)","04","99",null,null,"0499","999999999 - (All)"]
[null,null,null,null,null,null,null,null,null,null,null,null,null,null,"000002469","SAN JUAN DE KIMBIRI-VRAEM                                                                           ","05","00","09","07","0500","000002469 - SAN JUAN DE KIMBIRI-VRAEM                                                                           "]
[null,null,null,null,null,null,null,null,null,null,null,null,null,null,"000000000","(All)","05","01",null,null,"0501","000000000 - (All)"]
[null,null,null,null,null,null,null,null,null,null,null,null,null,null,"000002470","CHIRUMPIARI                                                                                         ","05","01","09","16","0501","000002470 - CHIRUMPIARI                                                                                         "]
[null,null,null,null,null,null,null,null,null,null,null,null,null,null,"000002471","LOBO TAHUANTINSUYO                                                                                  ","05","01","09","17","0501","000002471 - LOBO TAHUANTINSUYO                                                                                  "]
[null,null,null,null,null,null,null,null,null,null,null,null,null,null,"000002472","MAPITUNARI                                                                                          ","05","01","09","07","0501","000002472 - MAPITUNARI                                                                                          "]
[null,null,null,null,null,null,null,null,null,null,null,null,null,null,"000002473","UNION ROSALES                                                                                       ","05","01","09","17","0501","000002473 - UNION ROSALES                                                                                       "]
[null,null,null,null,null,null,null,null,null,null,null,null,null,null,"000002474","SAMANIATO                                                                                           ","05","01","09","07","0501","000002474 - SAMANIATO                                                                                           "]
[null,null,null,null,null,null,null,null,null,null,null,null,null,null,"000002475","KIMBIRI ALTO                                                                                        ","05","01","09","07","0501","000002475 - KIMBIRI ALTO                                                                                        "]
[null,null,null,null,null,null,null,null,null,null,null,null,null,null,"000002479","VILLA VIRGEN                                                                                        ","05","01","09",12,"0501","000002479 - VILLA VIRGEN                                                                                        "]
[null,null,null,null,null,null,null,null,null,null,null,null,null,null,"000002488","VILLA QUINTIARINA                                                                                   ","05","01","09",13,"0501","000002488 - VILLA QUINTIARINA                                                                                   "]
[null,null,null,null,null,null,null,null,null,null,null,null,null,null,"000008283","PUEBLO LIBRE                                                                                        ","05","01","09","07","0501","000008283 - PUEBLO LIBRE                                                                                        "]
[null,null,null,null,null,null,null,null,null,null,null,null,null,null,"000008284","MANITEA ALTA                                                                                        ","05","01","09","17","0501","000008284 - MANITEA ALTA                                                                                        "]
[null,null,null,null,null,null,null,null,null,null,null,null,null,null,"000008285","ANGELES                                                                                             ","05","01","09","07","0501","000008285 - ANGELES                                                                                             "]
[null,null,null,null,null,null,null,null,null,null,null,null,null,null,"000024957","EJERCITO-LA OROYA 34                                                                                 ","05","01","09",12,"0501","000024957 - EJERCITO-LA OROYA 34                                                                                 "]
[null,null,null,null,null,null,null,null,null,null,null,null,null,null,"000000000","(All)","05","02",null,null,"0502","000000000 - (All)"]
[null,null,null,null,null,null,null,null,null,null,null,null,null,null,"000002494","PICHARI                                                                                             ","05","02","09","10","0502","000002494 - PICHARI                                                                                             "]
[null,null,null,null,null,null,null,null,null,null,null,null,null,null,"000002495","MANTARO                                                                                             ","05","02","09","18","0502","000002495 - MANTARO                                                                                             "]
[null,null,null,null,null,null,null,null,null,null,null,null,null,null,"000002496","OMAYA                                                                                               ","05","02","09","10","0502","000002496 - OMAYA                                                                                               "]
[null,null,null,null,null,null,null,null,null,null,null,null,null,null,"000002497","OTARI                                                                                               ","05","02","09","10","0502","000002497 - OTARI                                                                                               "]
[null,null,null,null,null,null,null,null,null,null,null,null,null,null,"000002498","PUERTO MAYO                                                                                         ","05","02","09","10","0502","000002498 - PUERTO MAYO                                                                                         "]
[null,null,null,null,null,null,null,null,null,null,null,null,null,null,"000007113","NATIVIDAD                                                                                           ","05","02","09","10","0502","000007113 - NATIVIDAD                                                                                           "]
[null,null,null,null,null,null,null,null,null,null,null,null,null,null,"000007114","QUISTO CENTRAL                                                                                      ","05","02","09","10","0502","000007114 - QUISTO CENTRAL                                                                                      "]
[null,null,null,null,null,null,null,null,null,null,null,null,null,null,"000015104","TAMBO DEL ENE                                                                                       ","05","02","09","10","0502","000015104 - TAMBO DEL ENE                                                                                       "]
[null,null,null,null,null,null,null,null,null,null,null,null,null,null,"000015169","PITIRINQUINI                                                                                        ","05","02","09","10","0502","000015169 - PITIRINQUINI                                                                                        "]
[null,null,null,null,null,null,null,null,null,null,null,null,null,null,"000015170","PICHARI BAJA                                                                                        ","05","02","09","10","0502","000015170 - PICHARI BAJA                                                                                        "]
[null,null,null,null,null,null,null,null,null,null,null,null,null,null,"000024638","EJERCITO-MILITAR PICHARI                                                                    ","05","02","09","10","0502","000024638 - EJERCITO-MILITAR PICHARI                                                                    "]
[null,null,null,null,null,null,null,null,null,null,null,null,null,null,"000027230","SANIDAD-PICHARI PNP                                                                            ","05","02","09","10","0502","000027230 - SANIDAD-PICHARI PNP                                                                            "]
[null,null,null,null,null,null,null,null,null,null,null,null,null,null,"000027948","ESSALUD-PICHARI                                                                       ","05","02","09","10","0502","000027948 - ESSALUD-PICHARI                                                                       "]
[null,null,null,null,null,null,null,null,null,null,null,null,null,null,"000032211","NUEVO PROGRESO                                                          ","05","02","09","10","0502","000032211 - NUEVO PROGRESO                                                          "]
[null,null,null,null,null,null,null,null,null,null,null,null,null,null,"000033988","MENTAL COMUNITARIO PICHARI","05","02","09","10","0502","000033988 - MENTAL COMUNITARIO PICHARI"]
[null,null,null,null,null,null,null,null,null,null,null,null,null,null,"999999999","(All)","05","99",null,null,"0599","999999999 - (All)"]
[null,null,null,null,null,null,null,null,null,null,null,null,null,null,"000002398","HOSPITAL SANTO TOMAS","06","00","07","01","0600","000002398 - HOSPITAL SANTO TOMAS"]
[null,null,null,null,null,null,null,null,null,null,null,null,null,null,"000000000","(All)","06","09",null,null,"0609","000000000 - (All)"]
[null,null,null,null,null,null,null,null,null,null,null,null,null,null,"000002399","PULPERA                                                                                             ","06","09","07","01","0609","000002399 - PULPERA                                                                                             "]
[null,null,null,null,null,null,null,null,null,null,null,null,null,null,"000002400","ALHUACCHULLO                                                                                        ","06","09","07","01","0609","000002400 - ALHUACCHULLO                                                                                        "]
[null,null,null,null,null,null,null,null,null,null,null,null,null,null,"000002401","CCAPACMARCA                                                                                         ","06","09","07","02","0609","000002401 - CCAPACMARCA                                                                                         "]
[null,null,null,null,null,null,null,null,null,null,null,null,null,null,"000002404","COLQUEMARCA                                                                                         ","06","09","07","04","0609","000002404 - COLQUEMARCA                                                                                         "]
[null,null,null,null,null,null,null,null,null,null,null,null,null,null,"000002405","CHARAMURAY                                                                                          ","06","09","07","04","0609","000002405 - CHARAMURAY                                                                                          "]
[null,null,null,null,null,null,null,null,null,null,null,null,null,null,"000002407","LLUSCO                                                                                              ","06","09","07","06",{"$f":"CONCATENATE(Q397,R397)","v":"0609"},"000002407 - LLUSCO                                                                                              "]
[null,null,null,null,null,null,null,null,null,null,null,null,null,null,"000002408","QUIÑOTA                                                                                             ","06","09","07","07","0609","000002408 - QUIÑOTA                                                                                             "]
[null,null,null,null,null,null,null,null,null,null,null,null,null,null,"000002409","VELILLE                                                                                             ","06","09","07","08","0609",{"$f":"CONCATENATE(O399,\" - \",P399)","v":"000002409 - VELILLE                                                                                             "}]
[null,null,null,null,null,null,null,null,null,null,null,null,null,null,"000006746","LLIQUE                                                                                              ","06","09","07","01","0609","000006746 - LLIQUE                                                                                              "]
[null,null,null,null,null,null,null,null,null,null,null,null,null,null,"000006747","LUTTO                                                                                               ","06","09","07","06","0609","000006747 - LUTTO                                                                                               "]
[null,null,null,null,null,null,null,null,null,null,null,null,null,null,"000006748","COLLPA                                                                                              ","06","09","07","06","0609","000006748 - COLLPA                                                                                              "]
[null,null,null,null,null,null,null,null,null,null,null,null,null,null,"000006981","CCOYO                                                                                               ","06","09","07","01","0609","000006981 - CCOYO                                                                                               "]
[null,null,null,null,null,null,null,null,null,null,null,null,null,null,"000006982","MELLOTOTORA                                                                                         ","06","09","07","01","0609","000006982 - MELLOTOTORA                                                                                         "]
[null,null,null,null,null,null,null,null,null,null,null,null,null,null,"000006983","ORCCOMA                                                                                             ","06","09","07","01","0609","000006983 - ORCCOMA                                                                                             "]
[null,null,null,null,null,null,null,null,null,null,null,null,null,null,"000006984","CCOLLANA                                                                                            ","06","09","07","07","0609","000006984 - CCOLLANA                                                                                            "]
[null,null,null,null,null,null,null,null,null,null,null,null,null,null,"000006985","TOTORAPALLCA                                                                                        ","06","09","07","06","0609","000006985 - TOTORAPALLCA                                                                                        "]
[null,null,null,null,null,null,null,null,null,null,null,null,null,null,"000007111","YAVINA                                                                                              ","06","09","07","01","0609","000007111 - YAVINA                                                                                              "]
[null,null,null,null,null,null,null,null,null,null,null,null,null,null,"000007112","YORENCCA                                                                                            ","06","09","07","07","0609","000007112 - YORENCCA                                                                                            "]
[null,null,null,null,null,null,null,null,null,null,null,null,null,null,"000008912","ALCCA VICTORIA                                                                                      ","06","09","07","08","0609","000008912 - ALCCA VICTORIA                                                                                      "]
[null,null,null,null,null,null,null,null,null,null,null,null,null,null,"000008913","HUARACO                                                                                             ","06","09","07","04","0609","000008913 - HUARACO                                                                                             "]
[null,null,null,null,null,null,null,null,null,null,null,null,null,null,"000008914","HUAYLLANI                                                                                           ","06","09","07","04","0609","000008914 - HUAYLLANI                                                                                           "]
[null,null,null,null,null,null,null,null,null,null,null,null,null,null,"000008915","PFULLPURI CONDEPAMPA                                                                                ","06","09","07","01","0609","000008915 - PFULLPURI CONDEPAMPA                                                                                "]
[null,null,null,null,null,null,null,null,null,null,null,null,null,null,"000009963","CANCAHUANI                                                                                          ","06","09","07","02","0609","000009963 - CANCAHUANI                                                                                          "]
[null,null,null,null,null,null,null,null,null,null,null,null,null,null,"000012932","YANQUE                                                                                              ","06","09","07","04","0609","000012932 - YANQUE                                                                                              "]
[null,null,null,null,null,null,null,null,null,null,null,null,null,null,"000013185","ESSALUD-SANTO TOMAS","06","09","07","01","0609","000013185 - ESSALUD-SANTO TOMAS"]
[null,null,null,null,null,null,null,null,null,null,null,null,null,null,"000025369","PUMALLACTA","06","09","07","07","0609","000025369 - PUMALLACTA"]
[null,null,null,null,null,null,null,null,null,null,null,null,null,null,"000025371","TUNTUMA","06","09","07","08","0609","000025371 - TUNTUMA"]
[null,null,null,null,null,null,null,null,null,null,null,null,null,null,"000027008","ANTUYO","06","09","07","06","0609","000027008 - ANTUYO"]
[null,null,null,null,null,null,null,null,null,null,null,null,null,null,"000027009","TAHUAY","06","09","07","02","0609","000027009 - TAHUAY"]
[null,null,null,null,null,null,null,null,null,null,null,null,null,null,"000027011","AYACCASI","06","09","07","08","0609","000027011 - AYACCASI"]
[null,null,null,null,null,null,null,null,null,null,null,null,null,null,"000027016","HUAYCUÑUTA - URCURUTA","06","09","07","08","0609","000027016 - HUAYCUÑUTA - URCURUTA"]
[null,null,null,null,null,null,null,null,null,null,null,null,null,null,"000030940","ARCANGEL SAN MIGUEL DE ESQUINA CONGUNYA","06","09","07","01","0609","000030940 - ARCANGEL SAN MIGUEL DE ESQUINA CONGUNYA"]
[null,null,null,null,null,null,null,null,null,null,null,null,null,null,"000000000","(All)","06","01",null,null,"0601","000000000 - (All)"]
[null,null,null,null,null,null,null,null,null,null,null,null,null,null,"000002402","CHAMACA                                                                                             ","06","01","07","03","0601","000002402 - CHAMACA                                                                                             "]
[null,null,null,null,null,null,null,null,null,null,null,null,null,null,"000002403","AÑAHUICHI                                                                                           ","06","01","07","03","0601","000002403 - AÑAHUICHI                                                                                           "]
[null,null,null,null,null,null,null,null,null,null,null,null,null,null,"000002406","LIVITACA                                                                                            ","06","01","07","05","0601","000002406 - LIVITACA                                                                                            "]
[null,null,null,null,null,null,null,null,null,null,null,null,null,null,"000016325","CHILLOROYA - LIVITACA                                                                               ","06","01","07","05","0601","000016325 - CHILLOROYA - LIVITACA                                                                               "]
[null,null,null,null,null,null,null,null,null,null,null,null,null,null,"000016327","AUSANTA                                                                                             ","06","01","07","05","0601","000016327 - AUSANTA                                                                                             "]
[null,null,null,null,null,null,null,null,null,null,null,null,null,null,"000016328","UCCHUCCARCCO                                                                                        ","06","01","07","03","0601","000016328 - UCCHUCCARCCO                                                                                        "]
[null,null,null,null,null,null,null,null,null,null,null,null,null,null,"000016329","INGATA                                                                                              ","06","01","07","03","0601","000016329 - INGATA                                                                                              "]
[null,null,null,null,null,null,null,null,null,null,null,null,null,null,"000016330","CCONCHACCOLLO                                                                                       ","06","01","07","03","0601","000016330 - CCONCHACCOLLO                                                                                       "]
[null,null,null,null,null,null,null,null,null,null,null,null,null,null,"000016332","PATAQUEÑA - LIVITACA","06","01","07","05","0601","000016332 - PATAQUEÑA - LIVITACA"]
[null,null,null,null,null,null,null,null,null,null,null,null,null,null,"000016334","KISIO                                                                                               ","06","01","07","05","0601","000016334 - KISIO                                                                                               "]
[null,null,null,null,null,null,null,null,null,null,null,null,null,null,"000025739","PISQUICOCHA","06","01","07","05","0601","000025739 - PISQUICOCHA"]
[null,null,null,null,null,null,null,null,null,null,null,null,null,null,"000025740","TOTORA - REYNA DE LOS ANGELES","06","01","07","05","0601","000025740 - TOTORA - REYNA DE LOS ANGELES"]
[null,null,null,null,null,null,null,null,null,null,null,null,null,null,"999999999","(All)","06","99",null,null,"0699",{"$f":"CONCATENATE(O437,\" - \",P437)","v":"999999999 - (All)"}]
[null,null,null,null,null,null,null,null,null,null,null,null,null,null,"999999999","(All)","99","99",null,null,"9999",{"$f":"CONCATENATE(O438,\" - \",P438)","v":"999999999 - (All)"}]

{"sheet":"TD","index":1,"n_rows":152,"n_cols":247,"rows_kept":152,"cut":false,"hidden":true,"merged":[[1,1,1,3]]}
[]
[null,"Datos",null,null,null,"Tabla",{"$f":"IF(F3=\"(Todas)\",\"CUSCO \",\"\")","v":""}]
[null,"RED","03 - LA CONVENCION",null,null,{"$f":"TRIM(MID(C3,5,90))","v":"LA CONVENCION"},{"$f":"IF(F3=\"(All)\",\" \",F3)","v":"LA CONVENCION"}]
[null,"Micro Red","0399 - (All)",null,null,{"$f":"TRIM(MID(C4,7,90))","v":"(All)"}," "]
[null,"Establecimiento","999999999 - (All)",null,null,{"$f":"TRIM(MID(C5,12,90))","v":"(All)"}," "]
[null,"Provincia","00 - (All)",null,null,{"$f":"TRIM(MID(C6,6,90))","v":"(All)"}," "]
[null,"Distrito","0000 - (All)",null,null,{"$f":"TRIM(MID(C7,8,90))","v":"(All)"}," "]
[null,"UE","7777 - (All)",null,null,{"$f":"TRIM(MID(C8,8,90))","v":"(All)"}," "]
[]
[null,"AÑO","2024"]
[null,"MESES",1,2,3,4,5,6,7,8,9,10,11,0]
[null,"Mes_desc",{"$f":"IF(C11=1,\"ENERO\",\"\")","v":"ENERO"},{"$f":"IF(D11=2,\"FEBRERO\",\"\")","v":"FEBRERO"},{"$f":"IF(E11=3,\"MARZO\",\"\")","v":"MARZO"},{"$f":"IF(F11=4,\"ABRIL\",\"\")","v":"ABRIL"},{"$f":"IF(G11=5,\"MAYO\",\"\")","v":"MAYO"},{"$f":"IF(H11=6,\"JUNIO\",\"\")","v":"JUNIO"},{"$f":"IF(I11=7,\"JULIO\",\"\")","v":"JULIO"},{"$f":"IF(J11=8,\"AGOSTO\",\"\")","v":"AGOSTO"},{"$f":"IF(K11=9,\"SETIEMBRE\",\"\")","v":"SETIEMBRE"},{"$f":"IF(L11=10,\"OCTUBRE\",\"\")","v":"OCTUBRE"},{"$f":"IF(M11=11,\"NOVIEMBRE\",\"\")","v":"NOVIEMBRE"},{"$f":"IF(N11=12,\"DICIEMBRE\",\"\")","v":""},{"$f":"IF(C11=1,C12,IF(D11=2,D12,IF(E11=3,E12,IF(F11=4,F12,IF(G11=5,G12,IF(H11=6,H12,IF(I11=7,I12,IF(J11=8,J12,IF(K11=9,K12,IF(L11=10,L12,IF(M11=11,M12,IF(N11=12,N12,\"\"))))))))))))","v":"ENERO"}]
[]
[null,"ACUMULADO",20,22,24,26,28,30,32,34,36,38,40,null,{"$f":"MIN(C14:N14)","v":20},{"$f":"MAX(C14:N14)","v":40}]
[null,"Mes_desc_Acu",{"$f":"IF(C14=20,\"ENERO\",\"\")","v":"ENERO"},{"$f":"IF(D14=22,\"FEBRERO\",\"\")","v":"FEBRERO"},{"$f":"IF(E14=24,\"MARZO\",\"\")","v":"MARZO"},{"$f":"IF(F14=26,\"ABRIL\",\"\")","v":"ABRIL"},{"$f":"IF(G14=28,\"MAYO\",\"\")","v":"MAYO"},{"$f":"IF(H14=30,\"JUNIO\",\"\")","v":"JUNIO"},{"$f":"IF(I14=32,\"JULIO\",\"\")","v":"JULIO"},{"$f":"IF(J14=34,\"AGOSTO\",\"\")","v":"AGOSTO"},{"$f":"IF(K14=36,\"SETIEMBRE\",\"\")","v":"SETIEMBRE"},{"$f":"IF(L14=38,\"OCTUBRE\",\"\")","v":"OCTUBRE"},{"$f":"IF(M14=40,\"NOVIEMBRE\",\"\")","v":"NOVIEMBRE"},{"$f":"IF(N14=42,\"DICIEMBRE\",\"\")","v":""},{"$f":"IF(O14=C14,C15,IF(O14=D14,D15,IF(O14=E14,E15,IF(O14=F14,F15,IF(O14=G14,G15,IF(O14=H14,H15,IF(O14=I14,I15,IF(O14=J14,J15,IF(O14=K14,K15,IF(O14=L14,L15,IF(O14=M14,M15,IF(O14=N14,N15,\"\"))))))))))))","v":"ENERO"},{"$f":"IF(P14=D14,D15,IF(P14=E14,E15,IF(P14=F14,F15,IF(P14=G14,G15,IF(P14=H14,H15,IF(P14=I14,I15,IF(P14=J14,J15,IF(P14=K14,K15,IF(P14=L14,L15,IF(P14=M14,M15,IF(P14=N14,N15,IF(P14=O14,O15,\"\"))))))))))))","v":"NOVIEMBRE"}]
[null,null,null,null,null,null,null,null,null,null,null,null,null,null,{"$f":"CONCATENATE(O15,\" - \",P15)","v":"ENERO - NOVIEMBRE"}]
[null,null,null,null,null,null,null,null,null,null,null,null,null,null,{"$f":"IF(O14=P14,O12,O16)","v":"ENERO - NOVIEMBRE"}]
[]
[]
[]
[]
[]
[]
[]
[]
[]
[]
[]
["Salud Bucal 1"]
["Anio",2024]
["UE","(Todas)"]
["Red","LA CONVENCION"]
["MicroRed","(Todas)"]
["EESS","(Todas)"]
["Provincia","(Todas)"]
["Distrito","(Todas)"]
[]
["Etiquetas de fila","Suma de B_ABO_0_28d","Suma de B_ABO_29_5m","Suma de B_ABO_6_11m","Suma de B_ABO_1a","Suma de B_ABO_2a","Suma de B_ABO_3_5a","Suma de B_ABO_6_11a","Suma de B_ABO_Adolesc","Suma de B_ABO_Joven","Suma de B_ABO_Adulto","Suma de B_ABO_AdultoM","Suma de B_ABO_6_11a_g","Suma de B_ABO_Adolesc_g","Suma de B_ABO_Joven_g","Suma de B_ABO_Adulto_g","Suma de B_ANCED_I_0_28d","Suma de B_ANCED_I_29_5m","Suma de B_ANCED_I_6_11m","Suma de B_ANCED_I_1a","Suma de B_ANCED_I_2a","Suma de B_ANCED_I_3_5a","Suma de B_ANCED_I_6_11a","Suma de B_ANCED_I_Adolesc","Suma de B_ANCED_I_Joven","Suma de B_ANCED_I_Adulto","Suma de B_ANCED_I_AdultoM","Suma de B_ANCED_I_Gest","Suma de B_ANCED_CT_0_28d","Suma de B_ANCED_CT_29_5m","Suma de B_ANCED_CT_6_11m","Suma de B_ANCED_CT_1a","Suma de B_ANCED_CT_2a","Suma de B_ANCED_CT_3_5a","Suma de B_ANCED_CT_6_11a","Suma de B_ANCED_CT_Adolesc","Suma de B_ANCED_CT_Joven","Suma de B_ANCED_CT_Adulto","Suma de B_ANCED_CT_AdultoM","Suma de B_ANCED_CT_Gest","Suma de B_EXODON_CT_0_28d","Suma de B_EXODON_CT_29_5m","Suma de B_EXODON_CT_6_11m","Suma de B_EXODON_CT_1a","Suma de B_EXODON_CT_2a","Suma de B_EXODON_CT_3_5a","Suma de B_EXODON_CT_6_11a","Suma de B_EXODON_CT_Adolesc","Suma de B_EXODON_CT_Joven","Suma de B_EXODON_CT_Adulto","Suma de B_EXODON_CT_AdultoM","Suma de B_EXODON_CT_Gest","Suma de B_IHO_I_0_28d","Suma de B_IHO_I_29_5m","Suma de B_IHO_I_6_11m","Suma de B_IHO_I_1a","Suma de B_IHO_I_2a","Suma de B_IHO_I_3_5a","Suma de B_IHO_I_6_11a","Suma de B_IHO_I_Adolesc","Suma de B_IHO_I_Joven","Suma de B_IHO_I_Adulto","Suma de B_IHO_I_AdultoM","Suma de B_IHO_I_Gest","Suma de B_IHO_CT_0_28d","Suma de B_IHO_CT_29_5m","Suma de B_IHO_CT_6_11m","Suma de B_IHO_CT_1a","Suma de B_IHO_CT_2a","Suma de B_IHO_CT_3_5a","Suma de B_IHO_CT_6_11a","Suma de B_IHO_CT_Adolesc","Suma de B_IHO_CT_Joven","Suma de B_IHO_CT_Adulto","Suma de B_IHO_CT_AdultoM","Suma de B_IHO_CT_Gest","Suma de B_ASEL_I_0_28d","Suma de B_ASEL_I_29_5m","Suma de B_ASEL_I_6_11m","Suma de B_ASEL_I_1a","Suma de B_ASEL_I_2a","Suma de B_ASEL_I_3_5a","Suma de B_ASEL_I_6_11a","Suma de B_ASEL_I_Adolesc","Suma de B_ASEL_I_Joven","Suma de B_ASEL_I_Adulto","Suma de B_ASEL_I_AdultoM","Suma de B_ASEL_I_Gest","Suma de B_ASEL_CT_0_28d","Suma de B_ASEL_CT_29_5m","Suma de B_ASEL_CT_6_11m","Suma de B_ASEL_CT_1a","Suma de B_ASEL_CT_2a","Suma de B_ASEL_CT_3_5a","Suma de B_ASEL_CT_6_11a","Suma de B_ASEL_CT_Adolesc","Suma de B_ASEL_CT_Joven","Suma de B_ASEL_CT_Adulto","Suma de B_ASEL_CT_AdultoM","Suma de B_ASEL_CT_Gest","Suma de B_ABF_I_0_28d","Suma de B_ABF_I_29_5m","Suma de B_ABF_I_6_11m","Suma de B_ABF_I_1a","Suma de B_ABF_I_2a","Suma de B_ABF_I_3_5a","Suma de B_ABF_I_6_11a","Suma de B_ABF_I_Adolesc","Suma de B_ABF_I_Joven","Suma de B_ABF_I_Adulto","Suma de B_ABF_I_AdultoM","Suma de B_ABF_I_Gest","Suma de B_ABF_CT_0_28d","Suma de B_ABF_CT_29_5m","Suma de B_ABF_CT_6_11m","Suma de B_ABF_CT_1a","Suma de B_ABF_CT_2a","Suma de B_ABF_CT_3_5a","Suma de B_ABF_CT_6_11a","Suma de B_ABF_CT_Adolesc","Suma de B_ABF_CT_Joven","Suma de B_ABF_CT_Adulto","Suma de B_ABF_CT_AdultoM","Suma de B_ABF_CT_Gest","Suma de B_AFG_I_0_28d","Suma de B_AFG_I_29_5m","Suma de B_AFG_I_6_11m","Suma de B_AFG_I_1a","Suma de B_AFG_I_2a","Suma de B_AFG_I_3_5a","Suma de B_AFG_I_6_11a","Suma de B_AFG_I_Adolesc","Suma de B_AFG_I_Joven","Suma de B_AFG_I_Adulto","Suma de B_AFG_I_AdultoM","Suma de B_AFG_I_Gest","Suma de B_AFG_CT_0_28d","Suma de B_AFG_CT_29_5m","Suma de B_AFG_CT_6_11m","Suma de B_AFG_CT_1a","Suma de B_AFG_CT_2a","Suma de B_AFG_CT_3_5a","Suma de B_AFG_CT_6_11a","Suma de B_AFG_CT_Adolesc","Suma de B_AFG_CT_Joven","Suma de B_AFG_CT_Adulto","Suma de B_AFG_CT_AdultoM","Suma de B_AFG_CT_Gest","Suma de B_PD_I_0_28d","Suma de B_PD_I_29_5m","Suma de B_PD_I_6_11m","Suma de B_PD_I_1a","Suma de B_PD_I_2a","Suma de B_PD_I_3_5a","Suma de B_PD_I_6_11a","Suma de B_PD_I_Adolesc","Suma de B_PD_I_Joven","Suma de B_PD_I_Adulto","Suma de B_PD_I_AdultoM","Suma de B_PD_I_Gest","Suma de B_PD_CT_0_28d","Suma de B_PD_CT_29_5m","Suma de B_PD_CT_6_11m","Suma de B_PD_CT_1a","Suma de B_PD_CT_2a","Suma de B_PD_CT_3_5a","Suma de B_PD_CT_6_11a","Suma de B_PD_CT_Adolesc","Suma de B_PD_CT_Joven","Suma de B_PD_CT_Adulto","Suma de B_PD_CT_AdultoM","Suma de B_PD_CT_Gest"]
[1,2,8,15,10,7,15,18,15,11,8,7,0,2,3,8,3,8,17,17,17,138,249,210,211,335,106,156,0,0,1,0,2,11,12,8,13,8,3,7,3,8,18,17,18,142,252,209,212,335,108,157,3,8,17,17,18,138,250,210,209,335,106,157,0,0,1,0,2,11,12,8,13,8,3,7,0,0,0,0,0,15,64,15,1,0,0,2,0,0,0,0,0,3,18,3,0,0,0,2,0,1,15,16,18,148,262,151,116,38,24,130,0,0,1,0,2,20,34,17,12,0,1,7,0,0,0,0,0,1,13,27,49,234,60,25,0,0,0,0,0,0,2,5,7,18,3,3,0,1,6,11,14,145,269,193,193,308,94,150,0,0,0,0,2,18,34,20,19,15,4,8]
[2,1,1,0,10,4,17,25,18,8,15,9,0,0,7,7,1,1,2,18,13,108,184,151,118,200,68,88,0,0,0,1,0,11,25,12,6,8,2,22,1,1,2,17,15,113,189,151,122,201,70,90,1,1,2,18,13,107,184,150,118,201,66,89,0,0,0,1,0,11,25,12,6,8,2,19,0,0,0,0,2,12,52,8,0,0,0,0,0,0,0,0,0,2,13,2,0,0,0,0,0,0,1,17,12,106,180,109,68,13,13,76,0,0,0,1,1,13,24,10,9,0,0,26,0,0,0,1,0,0,2,15,36,149,40,11,0,0,0,0,0,0,1,3,10,19,2,7,0,0,1,9,12,106,187,138,113,192,56,86,0,0,0,1,1,13,25,13,20,13,2,30]
[3,1,3,11,9,4,18,22,11,14,5,10,0,3,14,9,1,3,14,17,14,102,209,190,229,266,98,107,0,0,1,2,1,14,28,12,13,9,11,46,1,3,15,18,14,104,200,189,228,272,108,106,1,3,14,18,14,103,210,191,232,268,103,106,0,0,1,2,1,14,28,12,13,9,11,45,0,0,0,0,0,16,45,6,0,0,0,0,0,0,0,0,0,6,10,2,0,0,0,0,0,2,15,17,13,110,187,142,137,43,11,93,0,0,1,1,3,20,36,12,19,3,0,48,0,0,1,0,0,1,12,31,61,167,72,14,0,0,0,0,0,0,1,7,11,22,15,6,0,2,7,11,10,107,202,180,209,243,84,103,0,0,0,1,3,17,34,22,26,21,15,54]
[4,2,0,23,22,8,79,181,50,14,16,7,0,4,32,25,1,0,29,31,32,310,806,450,174,293,121,151,0,2,9,7,3,50,60,19,20,31,9,75,2,0,29,31,32,306,808,455,178,296,120,151,1,0,29,31,32,311,810,452,175,292,121,152,0,2,9,7,3,51,61,19,21,30,10,75,0,0,0,0,0,15,80,15,0,0,0,2,0,0,0,0,0,4,19,3,0,0,0,1,0,0,24,30,30,313,793,419,136,76,25,130,0,1,6,7,4,64,73,22,23,10,2,70,0,0,0,0,0,3,10,23,24,160,88,22,0,0,0,1,0,0,1,3,8,25,8,10,0,0,4,10,26,289,744,409,163,261,114,147,0,1,6,6,5,65,80,20,27,34,11,75]
[5,0,0,19,8,7,33,32,15,22,10,5,0,1,14,15,0,0,22,15,20,244,197,157,110,176,61,85,0,0,1,2,6,20,28,21,23,25,8,61,0,0,23,15,22,246,198,154,112,181,62,84,0,0,23,15,20,247,195,158,109,171,61,85,0,0,1,2,6,20,29,21,23,25,8,60,0,0,0,0,2,14,31,2,0,0,0,0,0,0,0,0,0,7,9,0,0,0,0,0,0,0,19,12,19,248,191,107,80,21,5,80,0,0,1,1,8,30,34,20,26,10,3,62,0,0,0,0,0,0,3,42,28,126,49,9,0,0,0,0,0,0,1,3,0,23,6,2,0,0,4,5,16,228,193,149,115,163,57,85,0,0,0,0,7,28,36,24,26,31,10,65]
[6,0,3,6,27,21,49,137,19,22,21,22,0,2,19,19,0,2,6,33,39,140,346,126,135,245,100,115,0,1,2,2,6,53,163,24,32,33,12,54,0,2,7,35,39,140,345,127,136,255,101,112,0,2,7,34,39,140,344,126,137,249,102,116,0,1,2,2,6,54,164,24,31,32,12,55,0,0,0,0,4,40,175,4,1,0,0,0,0,0,0,0,1,11,43,0,0,0,0,0,0,1,7,32,37,142,342,76,81,50,13,102,0,0,2,3,8,66,180,25,28,14,5,54,0,0,0,1,1,3,4,43,37,158,45,9,0,0,0,0,0,1,1,22,12,21,8,9,0,0,2,16,31,137,335,126,129,243,65,107,0,0,1,2,8,60,211,55,43,34,15,59]
[7,0,1,10,16,8,36,94,25,18,16,11,0,3,13,11,3,1,13,21,12,154,364,325,130,230,77,112,0,0,0,5,6,35,73,28,26,37,16,65,2,1,13,21,12,154,372,326,134,239,72,117,3,1,13,21,12,155,363,323,134,230,76,113,0,0,0,5,6,35,74,29,27,37,15,65,0,0,0,0,0,27,120,12,0,0,0,0,0,0,0,0,0,11,52,6,0,0,0,0,0,1,11,20,14,152,364,307,99,45,7,105,0,0,0,6,6,35,77,22,22,6,1,64,0,0,1,1,0,11,7,13,28,162,59,2,0,0,0,0,0,0,2,5,8,36,14,5,0,0,8,10,10,148,368,327,119,206,66,107,0,0,0,2,6,62,86,29,33,40,18,66]
[8,0,2,6,11,7,24,93,13,6,10,4,0,0,14,16,1,2,13,15,13,70,244,267,136,203,95,113,0,0,2,4,1,27,152,50,21,33,16,52,1,2,12,18,14,71,236,270,138,204,93,118,1,2,12,16,14,73,246,270,137,208,96,113,0,0,3,4,1,27,153,50,22,32,17,53,0,0,0,0,0,1,62,0,1,0,0,0,0,0,0,0,0,1,28,0,0,0,0,0,0,1,10,18,15,77,269,258,84,35,11,92,0,0,3,4,2,30,146,47,24,5,0,56,0,0,0,0,1,5,9,15,38,149,77,19,0,0,0,0,0,2,10,6,7,51,18,5,0,0,7,14,11,72,263,269,132,195,92,113,0,0,1,1,2,29,189,65,32,46,24,58]
[9,0,0,5,16,17,91,198,58,13,15,11,0,3,17,16,0,0,6,22,24,84,190,104,122,219,88,88,0,0,2,9,7,103,349,69,32,37,17,56,0,0,6,20,25,84,179,103,114,222,90,88,0,0,6,23,26,85,188,104,122,221,88,90,0,0,2,9,6,105,354,67,31,37,18,57,0,0,0,0,0,47,200,19,12,3,0,0,0,0,0,0,0,15,72,5,5,2,0,0,0,0,4,21,24,84,173,81,88,14,6,78,0,0,2,8,9,109,353,64,29,15,1,57,0,0,0,0,1,2,5,14,20,163,64,9,0,0,0,0,0,1,2,7,8,36,18,4,0,0,0,16,23,85,184,96,121,195,73,88,0,0,2,6,8,111,350,69,36,53,15,59]
[10,0,10,12,11,9,141,199,81,15,16,12,0,2,14,11,0,10,14,14,20,125,216,87,144,211,79,86,0,0,3,10,5,149,304,124,38,44,14,36,0,10,14,15,20,117,184,83,137,200,73,77,0,10,15,14,20,128,217,87,144,215,80,87,0,0,3,10,5,149,304,124,38,45,12,36,0,0,0,0,0,44,70,7,0,0,0,0,0,0,0,0,0,7,18,2,0,0,0,0,0,0,13,15,20,126,225,79,96,34,6,79,0,0,3,10,6,153,344,132,38,4,1,36,0,0,1,0,0,2,4,1,30,145,62,4,0,0,0,0,0,2,3,0,10,45,14,3,0,0,12,12,18,129,227,84,138,202,76,85,0,0,3,7,5,129,334,132,44,46,15,38]
[11,0,2,7,9,6,124,295,154,18,15,7,0,0,17,16,1,1,7,12,15,91,103,93,100,185,69,94,0,7,2,6,2,143,351,248,36,48,14,54,0,2,6,11,14,76,86,87,93,182,67,87,1,1,7,12,15,91,102,94,99,187,71,92,0,7,2,6,2,141,349,248,35,48,13,54,0,0,0,0,0,25,283,10,0,0,0,0,0,0,0,0,0,5,78,5,0,0,0,0,0,0,6,12,14,93,109,82,61,24,4,88,0,0,1,5,3,156,357,239,38,12,1,56,0,0,1,0,1,2,3,3,27,141,53,1,0,0,0,1,0,3,14,6,3,37,15,3,0,0,4,7,10,92,109,94,98,175,63,90,0,0,1,6,4,162,310,218,40,54,17,56]
["Total general",6,30,114,149,98,627,1294,459,161,147,105,0,20,164,153,11,28,143,215,219,1566,3108,2160,1609,2563,962,1195,0,10,23,48,39,616,1545,615,260,313,122,528,10,29,145,218,225,1553,3049,2154,1604,2587,964,1187,11,28,145,219,223,1578,3109,2165,1616,2577,970,1200,0,10,24,48,38,618,1553,614,260,311,121,526,0,0,0,0,8,256,1182,98,15,3,0,4,0,0,0,0,1,72,360,28,5,2,0,3,0,6,125,210,216,1599,3095,1811,1046,393,125,1053,0,1,20,46,52,696,1658,610,268,79,15,536,0,0,4,3,4,30,72,227,378,1754,669,125,0,0,0,2,0,9,38,67,84,333,121,57,0,3,55,121,181,1538,3081,2065,1530,2383,840,1161,0,1,14,32,51,694,1689,667,346,387,146,568]
[]
[]
["Salud Bucal 2"]
["Anio",2024]
["UE","(Todas)"]
["Red","LA CONVENCION"]
["MicroRed","(Todas)"]
["EESS","(Todas)"]
["Provincia","(Todas)"]
["Distrito","(Todas)"]
[]
["Etiquetas de fila","Suma de B_Destartraje_CT_0_28d","Suma de B_Destartraje_CT_29_5m","Suma de B_Destartraje_CT_6_11m","Suma de B_Destartraje_CT_1a","Suma de B_Destartraje_CT_2a","Suma de B_Destartraje_CT_3_5a","Suma de B_Destartraje_CT_6_11a","Suma de B_Destartraje_CT_Adolesc","Suma de B_Destartraje_CT_Joven","Suma de B_Destartraje_CT_Adulto","Suma de B_Destartraje_CT_AdultoM","Suma de B_Destartraje_CT_Gest","Suma de B_Debridacion_Bucoden_0_28d","Suma de B_Debridacion_Bucoden_29_5m","Suma de B_Debridacion_Bucoden_6_11m","Suma de B_Debridacion_Bucoden_1a","Suma de B_Debridacion_Bucoden_2a","Suma de B_Debridacion_Bucoden_3_5a","Suma de B_Debridacion_Bucoden_6_11a","Suma de B_Debridacion_Bucoden_Adolesc","Suma de B_Debridacion_Bucoden_Joven","Suma de B_Debridacion_Bucoden_Adulto","Suma de B_Debridacion_Bucoden_AdultoM","Suma de B_Debridacion_Bucoden_Gest","Suma de B_Consulta_Estomato_0_28d","Suma de B_Consulta_Estomato_29_5m","Suma de B_Consulta_Estomato_6_11m","Suma de B_Consulta_Estomato_1a","Suma de B_Consulta_Estomato_2a","Suma de B_Consulta_Estomato_3_5a","Suma de B_Consulta_Estomato_6_11a","Suma de B_Consulta_Estomato_Adolesc","Suma de B_Consulta_Estomato_Joven","Suma de B_Consulta_Estomato_Adulto","Suma de B_Consulta_Estomato_AdultoM","Suma de B_Consulta_Estomato_Gest","Suma de B_Exodoncia_Simple_I_0_28d","Suma de B_Exodoncia_Simple_I_29_5m","Suma de B_Exodoncia_Simple_I_6_11m","Suma de B_Exodoncia_Simple_I_1a","Suma de B_Exodoncia_Simple_I_2a","Suma de B_Exodoncia_Simple_I_3_5a","Suma de B_Exodoncia_Simple_I_6_11a","Suma de B_Exodoncia_Simple_I_Adolesc","Suma de B_Exodoncia_Simple_I_Joven","Suma de B_Exodoncia_Simple_I_Adulto","Suma de B_Exodoncia_Simple_I_AdultoM","Suma de B_Exodoncia_Simple_I_Gest","Suma de B_Ionomero_Vidrio_I_0_28d","Suma de B_Ionomero_Vidrio_I_29_5m","Suma de B_Ionomero_Vidrio_I_6_11m","Suma de B_Ionomero_Vidrio_I_1a","Suma de B_Ionomero_Vidrio_I_2a","Suma de B_Ionomero_Vidrio_I_3_5a","Suma de B_Ionomero_Vidrio_I_6_11a","Suma de B_Ionomero_Vidrio_I_Adolesc","Suma de B_Ionomero_Vidrio_I_Joven","Suma de B_Ionomero_Vidrio_I_Adulto","Suma de B_Ionomero_Vidrio_I_AdultoM","Suma de B_Ionomero_Vidrio_I_Gest","Suma de B_Resina_I_0_28d","Suma de B_Resina_I_29_5m","Suma de B_Resina_I_6_11m","Suma de B_Resina_I_1a","Suma de B_Resina_I_2a","Suma de B_Resina_I_3_5a","Suma de B_Resina_I_6_11a","Suma de B_Resina_I_Adolesc","Suma de B_Resina_I_Joven","Suma de B_Resina_I_Adulto","Suma de B_Resina_I_AdultoM","Suma de B_Resina_I_Gest","Suma de B_Pulpotomia_I_6_11m","Suma de B_Pulpotomia_I_1a","Suma de B_Pulpotomia_I_2a","Suma de B_Pulpotomia_I_3_5a","Suma de B_Pulpotomia_I_6_11a","Suma de B_Pulpotomia_I_Adolesc","Suma de B_Pulpotomia_I_Joven","Suma de B_Pulpotomia_I_Adulto","Suma de B_Pulpotomia_I_AdultoM","Suma de B_Pulpotomia_I_Gest","Suma de B_TEndodontica_IA_6_11m","Suma de B_TEndodontica_IA_1a","Suma de B_TEndodontica_IA_2a","Suma de B_TEndodontica_IA_3_5a","Suma de B_TEndodontica_IA_6_11a","Suma de B_TEndodontica_IA_Adolesc","Suma de B_TEndodontica_IA_Joven","Suma de B_TEndodontica_IA_Adulto","Suma de B_TEndodontica_IA_AdultoM","Suma de B_TEndodontica_IA_g","Suma de B_TEndodontica_CA_6_11m","Suma de B_TEndodontica_CA_1a","Suma de B_TEndodontica_CA_2a","Suma de B_TEndodontica_CA_3_5a","Suma de B_TEndodontica_CA_6_11a","Suma de B_TEndodontica_CA_Adolesc","Suma de B_TEndodontica_CA_Joven","Suma de B_TEndodontica_CA_Adulto","Suma de B_TEndodontica_CA_AdultoM","Suma de B_TEndodontica_CA_g","Suma de B_TEndodontica_TA_6_11m","Suma de B_TEndodontica_TA_1a","Suma de B_TEndodontica_TA_2a","Suma de B_TEndodontica_TA_3_5a","Suma de B_TEndodontica_TA_6_11a","Suma de B_TEndodontica_TA_Adolesc","Suma de B_TEndodontica_TA_Joven","Suma de B_TEndodontica_TA_Adulto","Suma de B_TEndodontica_TA_AdultoM","Suma de B_TEndodontica_TA_g","Suma de B_OrtopediaMaxilar_ia_6_11m","Suma de B_OrtopediaMaxilar_ia_1a","Suma de B_OrtopediaMaxilar_ia_2a","Suma de B_OrtopediaMaxilar_ia_3_5a","Suma de B_OrtopediaMaxilar_ia_6_11a","Suma de B_OrtopediaMaxilar_ia_Adolesc","Suma de B_OrtopediaMaxilar_ia_Joven","Suma de B_OrtopediaMaxilar_ia_Adulto","Suma de B_OrtopediaMaxilar_ia_AdultoM","Suma de B_OrtopediaMaxilar_ia_g","Suma de B_OrtopediaMaxilar_in_6_11m","Suma de B_OrtopediaMaxilar_in_1a","Suma de B_OrtopediaMaxilar_in_2a","Suma de B_OrtopediaMaxilar_in_3_5a","Suma de B_OrtopediaMaxilar_in_6_11a","Suma de B_OrtopediaMaxilar_in_Adolesc","Suma de B_OrtopediaMaxilar_in_Joven","Suma de B_OrtopediaMaxilar_in_Adulto","Suma de B_OrtopediaMaxilar_in_AdultoM","Suma de B_OrtopediaMaxilar_in_g","Suma de B_OrtopediaMaxilar_ca_6_11m","Suma de B_OrtopediaMaxilar_ca_1a","Suma de B_OrtopediaMaxilar_ca_2a","Suma de B_OrtopediaMaxilar_ca_3_5a","Suma de B_OrtopediaMaxilar_ca_6_11a","Suma de B_OrtopediaMaxilar_ca_Adolesc","Suma de B_OrtopediaMaxilar_ca_Joven","Suma de B_OrtopediaMaxilar_ca_Adulto","Suma de B_OrtopediaMaxilar_ca_AdultoM","Suma de B_OrtopediaMaxilar_ca_g","Suma de B_OrtopediaMaxilar_ta_6_11m","Suma de B_OrtopediaMaxilar_ta_1a","Suma de B_OrtopediaMaxilar_ta_2a","Suma de B_OrtopediaMaxilar_ta_3_5a","Suma de B_OrtopediaMaxilar_ta_6_11a","Suma de B_OrtopediaMaxilar_ta_Adolesc","Suma de B_OrtopediaMaxilar_ta_Joven","Suma de B_OrtopediaMaxilar_ta_Adulto","Suma de B_OrtopediaMaxilar_ta_AdultoM","Suma de B_OrtopediaMaxilar_ta_g","Suma de B_RehabProtesica_ip_3_5a","Suma de B_RehabProtesica_ip_6_11a","Suma de B_RehabProtesica_ip_Adolesc","Suma de B_RehabProtesica_ip_Joven","Suma de B_RehabProtesica_ip_Adulto","Suma de B_RehabProtesica_ip_AdultoM","Suma de B_RehabProtesica_ip_g","Suma de B_RehabProtesica_id_3_5a","Suma de B_RehabProtesica_id_6_11a","Suma de B_RehabProtesica_id_Adolesc","Suma de B_RehabProtesica_id_Joven","Suma de B_RehabProtesica_id_Adulto","Suma de B_RehabProtesica_id_AdultoM","Suma de B_RehabProtesica_id_g","Suma de B_RehabProtesica_ri_3_5a","Suma de B_RehabProtesica_ri_6_11a","Suma de B_RehabProtesica_ri_Adolesc","Suma de B_RehabProtesica_ri_Joven","Suma de B_RehabProtesica_ri_Adulto","Suma de B_RehabProtesica_ri_AdultoM","Suma de B_RehabProtesica_ri_g","Suma de B_RehabProtesica_pen_3_5a","Suma de B_RehabProtesica_pen_6_11a","Suma de B_RehabProtesica_pen_Adolesc","Suma de B_RehabProtesica_pen_Joven","Suma de B_RehabProtesica_pen_Adulto","Suma de B_RehabProtesica_pen_AdultoM","Suma de B_RehabProtesica_pen_g","Suma de B_RehabProtesica_in_3_5a","Suma de B_RehabProtesica_in_6_11a","Suma de B_RehabProtesica_in_Adolesc","Suma de B_RehabProtesica_in_Joven","Suma de B_RehabProtesica_in_Adulto","Suma de B_RehabProtesica_in_AdultoM","Suma de B_RehabProtesica_in_g","Suma de B_RehabProtesica_1c_3_5a","Suma de B_RehabProtesica_1cn_6_11a","Suma de B_RehabProtesica_1c_Adolesc","Suma de B_RehabProtesica_1c_Joven","Suma de B_RehabProtesica_1c_Adulto","Suma de B_RehabProtesica_1c_AdultoM","Suma de B_RehabProtesica_1c_g","Suma de B_RehabProtesica_2c_3_5a","Suma de B_RehabProtesica_2cn_6_11a","Suma de B_RehabProtesica_2c_Adolesc","Suma de B_RehabProtesica_2c_Joven","Suma de B_RehabProtesica_2c_Adulto","Suma de B_RehabProtesica_2c_AdultoM","Suma de B_RehabProtesica_2c_g"]
[1,0,0,0,0,0,0,6,33,41,76,29,48,0,0,0,0,0,5,10,10,5,10,2,1,0,0,0,4,2,45,96,50,87,126,49,9,0,0,0,0,0,4,88,38,62,119,69,6,0,0,0,0,0,79,50,17,21,40,4,17,0,0,0,1,16,104,260,388,282,331,50,142,0,0,2,10,9,40,28,26,5,2,0,0,0,1,0,0,0,0,0,0,0,0,0,0,0,0,0,0,1,0,0,0,2,10,0,0,0,0,0,0,0,0,0,0,0,0,0,0,0,0,0,0,0,0,0,0,0,0,0,0,0,0,0,0,0,0,0,0,0,0,0,0,0,0,0,0,0,0,0,0,0,0,0,0,0,0,0,0,0,0,0,0,0,0,0,0,0,0,0,0,0,0,0,0,0,0,0,0,0,0,0,0,0,0,0,0,0,0,0,0,0,0,0,0,0,0,0,0,0]
[2,0,0,0,0,0,1,1,23,25,49,16,35,0,0,0,0,1,4,3,0,4,3,0,0,1,0,0,0,3,28,65,46,48,78,29,11,0,0,0,0,0,15,90,32,36,73,49,5,0,0,0,0,2,73,59,18,16,37,10,11,0,0,0,0,4,107,233,288,182,258,33,110,0,0,0,4,30,42,10,19,9,6,0,0,0,0,1,0,1,0,0,0,0,0,0,0,0,0,1,0,0,0,0,0,0,1,0,0,1,0,0,0,0,0,0,0,0,0,0,0,0,0,0,0,0,0,0,0,0,0,0,0,0,0,0,0,0,0,0,0,0,0,0,0,0,0,0,0,0,0,0,0,0,0,0,0,0,0,0,0,0,0,0,0,0,0,0,0,0,0,0,0,0,0,0,0,0,0,0,0,0,0,0,0,0,0,0,0,0,0,0,0,0,0,0,0,0,0,0,0,0]
[3,0,0,0,0,0,1,3,17,49,73,37,37,0,0,0,0,0,5,1,3,5,15,3,1,0,0,0,0,1,31,33,48,91,107,51,10,0,0,0,0,0,15,79,41,82,115,55,11,0,0,0,0,1,82,71,28,21,9,3,7,0,0,0,0,3,113,204,259,282,272,59,177,0,0,0,5,13,21,15,17,1,2,0,0,0,1,0,1,2,0,0,0,0,0,0,0,0,1,2,1,0,0,0,0,0,11,5,1,2,1,0,0,0,0,0,0,0,0,0,0,0,0,0,0,0,0,0,0,0,0,0,0,0,0,0,0,0,0,0,0,0,0,0,0,0,0,0,0,0,0,0,0,0,0,0,0,0,0,0,0,0,0,0,0,0,0,0,0,0,0,0,0,0,0,0,0,0,0,0,0,0,0,0,0,0,0,0,0,0,0,0,0,0,0,0,0,0,0,0,0,0]
[4,0,0,0,0,0,1,4,59,53,68,26,78,0,0,0,0,0,7,7,3,3,11,2,0,0,0,0,1,1,29,50,25,66,102,39,26,0,0,0,0,0,8,80,45,68,120,52,18,0,0,0,1,0,80,29,13,17,17,10,15,0,0,0,1,6,113,206,204,271,290,61,251,0,0,0,4,23,10,14,21,1,22,0,0,0,3,0,0,2,2,0,0,0,0,0,2,0,0,2,0,0,0,0,0,0,17,0,0,2,0,0,0,0,0,0,0,0,0,0,0,0,0,0,0,0,0,0,0,0,0,0,0,0,0,0,0,0,0,0,0,0,0,0,0,0,0,0,0,0,0,0,0,0,0,0,0,0,0,0,0,0,0,0,0,0,0,0,0,0,0,0,0,0,0,0,0,0,0,0,0,0,0,0,0,0,0,0,0,0,0,0,0,0,0,0,0,0,0,0,0,0]
[5,0,0,0,1,0,2,1,12,32,60,20,46,0,0,0,0,0,4,5,3,6,14,1,0,0,0,0,0,1,21,37,39,56,83,35,2,0,0,0,0,0,8,63,28,43,71,51,10,0,0,0,0,0,219,43,14,7,8,2,8,0,0,1,1,6,116,118,147,156,210,42,151,0,0,0,3,3,4,7,9,1,1,0,0,0,0,0,0,0,1,0,0,0,0,0,0,0,0,0,0,0,0,0,0,0,4,1,0,0,0,0,0,0,0,0,0,0,0,0,0,0,0,0,0,0,0,0,0,0,0,0,0,0,0,0,0,0,0,0,0,0,0,0,0,0,0,0,0,0,0,0,0,0,0,0,0,0,0,0,0,0,0,0,0,0,0,0,0,0,0,0,0,0,0,0,0,0,0,0,0,0,0,0,0,0,0,0,0,0,0,0,0,0,0,0,0,0,0,0,0,0]
[6,0,0,0,0,0,0,2,25,42,104,18,65,0,0,0,0,0,6,4,4,8,11,7,1,0,0,0,1,4,35,40,38,60,96,42,6,0,0,0,0,1,14,94,33,50,93,58,6,0,0,0,0,13,64,54,10,16,20,8,11,0,0,2,3,10,113,262,189,224,269,59,157,0,0,0,1,3,10,9,5,0,4,0,0,0,1,1,1,2,0,0,0,0,0,0,0,1,1,2,0,0,0,0,0,0,2,0,1,2,0,0,0,0,0,0,0,0,0,0,0,0,0,0,0,0,0,0,0,0,0,0,0,0,0,0,0,0,0,0,0,0,0,0,0,0,0,0,0,0,0,0,0,0,0,0,0,0,0,0,0,0,0,0,0,0,0,0,0,0,0,0,0,0,0,0,0,0,0,0,0,0,0,0,0,0,0,0,0,0,0,0,0,0,0,0,0,0,0,0,0,0]
[7,0,0,0,0,0,5,2,12,28,60,25,73,0,0,0,0,0,4,6,11,13,8,3,0,2,0,0,0,4,32,39,34,60,104,39,10,0,0,0,0,0,10,87,28,48,129,68,9,0,0,0,0,2,114,68,162,8,21,1,11,0,0,0,2,7,105,170,145,216,253,79,193,0,0,0,1,6,13,20,14,12,3,0,0,0,5,0,4,6,0,0,0,0,0,0,0,0,4,3,0,0,0,0,0,0,4,1,4,0,0,0,0,0,0,0,0,0,0,0,0,0,0,0,0,0,0,0,0,0,0,0,0,0,0,0,0,0,0,0,0,0,0,0,0,0,0,0,0,0,0,0,0,0,0,0,0,0,0,0,0,0,0,0,0,0,0,0,0,0,0,0,0,0,0,0,0,0,0,0,0,0,0,0,0,0,0,0,0,0,0,0,0,0,0,0,0,0,0,0,0,0]
[8,0,0,0,0,0,2,2,31,32,68,32,62,0,0,0,0,0,4,6,8,8,11,2,0,0,0,0,2,3,25,56,39,60,114,51,13,0,0,0,0,0,4,67,25,42,108,70,9,0,0,1,0,3,44,40,14,14,14,0,8,0,0,2,0,2,90,246,241,237,247,42,131,0,0,0,3,6,20,10,15,2,1,0,0,0,2,2,4,1,3,0,0,0,0,0,1,1,4,1,0,0,0,0,0,0,1,1,4,0,0,0,1,0,0,0,0,0,0,0,0,0,0,0,0,0,0,0,0,0,0,0,0,0,0,0,0,0,0,0,0,0,0,0,0,0,0,0,0,0,0,0,0,0,0,0,0,0,0,0,0,0,0,0,0,0,0,0,0,0,0,0,0,0,0,0,0,0,0,0,0,0,0,0,0,0,0,0,0,0,0,0,0,0,0,0,0,0,0,0,0,0]
[9,0,0,0,0,1,2,3,35,33,62,43,55,0,0,0,0,1,6,5,9,11,13,2,1,0,0,0,4,1,28,44,41,70,101,45,9,0,0,0,0,0,13,66,42,54,124,74,2,0,0,0,1,2,122,45,9,12,14,3,3,0,0,0,1,4,116,174,235,197,252,65,134,0,0,0,5,8,9,6,18,11,14,0,0,0,2,0,0,0,1,0,0,0,0,0,2,1,0,0,1,0,0,0,0,0,2,0,0,0,0,0,0,0,0,0,0,0,0,0,0,0,0,0,0,0,0,0,0,0,0,0,0,0,0,0,0,0,0,0,0,0,0,0,0,0,0,0,0,0,0,0,0,0,0,0,0,0,0,0,0,0,0,0,0,0,0,0,0,0,0,0,0,0,0,0,0,0,0,0,0,0,0,0,0,0,0,0,0,0,0,0,0,0,0,0,0,0,0,0,0,0]
[10,0,0,0,0,0,1,3,6,42,79,26,55,0,0,0,0,0,2,8,4,11,9,0,0,3,0,0,0,1,36,65,39,69,146,46,10,0,0,0,0,0,12,74,37,59,125,60,17,0,0,0,0,4,66,112,10,15,18,4,2,0,0,0,1,0,160,240,203,242,237,53,113,0,0,0,4,4,10,19,20,4,3,0,0,0,2,0,0,0,1,0,1,0,0,0,1,0,0,0,2,0,0,0,0,0,0,2,0,0,0,0,0,0,0,0,0,0,0,0,0,0,0,0,0,0,0,0,0,0,0,0,0,0,0,0,0,0,0,0,0,0,0,0,0,0,0,0,0,0,0,0,0,0,0,0,0,0,0,0,0,0,0,0,0,0,0,0,0,0,0,0,0,0,0,0,0,0,0,0,0,0,0,0,0,0,0,0,0,0,0,0,0,0,0,0,0,0,0,0,0,0]
[11,0,0,0,0,0,2,4,24,28,51,8,53,0,0,0,0,0,2,4,4,8,6,0,1,2,0,1,1,0,26,47,36,45,98,26,12,0,0,0,0,0,9,81,43,54,126,61,7,0,0,0,0,8,114,155,22,12,9,5,0,0,0,1,0,1,97,157,167,159,219,28,101,0,0,0,11,23,11,10,19,0,4,0,0,0,0,0,0,0,1,0,0,0,0,0,0,0,0,0,0,0,0,0,0,0,4,0,0,0,0,0,0,0,0,0,0,0,0,0,0,0,0,0,0,0,0,0,0,0,0,0,0,0,0,0,0,0,0,0,0,0,0,0,0,0,0,0,0,0,0,0,0,0,0,0,0,0,0,0,0,0,0,0,0,0,0,0,0,0,0,0,0,0,0,0,0,0,0,0,0,0,0,0,0,0,0,0,0,0,0,0,0,0,0,0,0,0,0,0,0,0]
["Total general",0,0,0,1,1,17,31,277,405,750,280,607,0,0,0,0,2,49,59,59,82,111,22,5,8,0,1,13,21,336,572,435,712,1155,452,118,0,0,0,0,1,112,869,392,598,1203,667,100,0,0,1,2,35,1057,726,317,159,207,50,93,0,0,6,10,59,1234,2270,2466,2448,2838,571,1660,0,0,2,51,128,190,148,183,46,62,0,0,0,17,4,10,14,9,0,1,0,0,0,6,3,10,11,4,1,0,0,0,2,56,10,10,7,1,0,1,0,0,0,0,0,0,0,0,0,0,0,0,0,0,0,0,0,0,0,0,0,0,0,0,0,0,0,0,0,0,0,0,0,0,0,0,0,0,0,0,0,0,0,0,0,0,0,0,0,0,0,0,0,0,0,0,0,0,0,0,0,0,0,0,0,0,0,0,0,0,0,0,0,0,0,0,0,0,0,0,0,0,0,0,0,0,0,0,0]
[]
[]
["Salud Bucal 3"]
["Anio",2024]
["UE","(Todas)"]
["Red","LA CONVENCION"]
["MicroRed","(Todas)"]
["EESS","(Todas)"]
["Provincia","(Todas)"]
["Distrito","(Todas)"]
[]
["Etiquetas de fila","Suma de B_TtoPeriodontal_3_5a","Suma de B_TtoPeriodontal_6_11a","Suma de B_TtoPeriodontal_Adolesc","Suma de B_TtoPeriodontal_Joven","Suma de B_TtoPeriodontal_Adulto","Suma de B_TtoPeriodontal_AdultoM","Suma de B_TtoPeriodontal_g","Suma de B_MaxiloFacial_I_0_28d","Suma de B_MaxiloFacial_I_29_5m","Suma de B_MaxiloFacial_I_6_11m","Suma de B_MaxiloFacial_I_1a","Suma de B_MaxiloFacial_I_2a","Suma de B_MaxiloFacial_3_5a","Suma de B_MaxiloFacial_6_11a","Suma de B_MaxiloFacial_Adolesc","Suma de B_MaxiloFacial_Joven","Suma de B_MaxiloFacial_Adulto","Suma de B_MaxiloFacial_AdultoM","Suma de B_MaxiloFacial_g","Suma de B_GR_Edu_doce_Act","Suma de B_GR_Edu_doce_Pers","Suma de B_GR_Edu_Alu_Act","Suma de B_GR_Edu_Alu_Pers","Suma de B_GR_Edu_Mujer_Act","Suma de B_GR_Edu_Mujer_Pers","Suma de B_GR_Edu_Gest_Act","Suma de B_GR_Edu_Gest_Pers","Suma de B_GR_Edu_Puerp_Act","Suma de B_GR_Edu_Puerp_Pers","Suma de B_GR_Dem_doce_Act","Suma de B_GR_Dem_doce_Pers","Suma de B_GR_Dem_Alu_Act","Suma de B_GR_Dem_Alu_Pers","Suma de B_GR_Dem_Mujer_Act","Suma de B_GR_Dem_Mujer_Pers","Suma de B_GR_Dem_Gest_Act","Suma de B_GR_Dem_Gest_Pers","Suma de B_GR_Dem_Puerp_Act","Suma de B_GR_Dem_Puerp_Pers","Suma de B_GR_Edu_Niño_Act","Suma de B_GR_Edu_Niño_Pers","Suma de B_GR_Edu_Adoles_Act","Suma de B_GR_Edu_Adoles_Pers","Suma de B_GR_Edu_Joven_Act","Suma de B_GR_Edu_Joven_Pers","Suma de B_GR_Edu_Adulto_Act","Suma de B_GR_Edu_Adulto_Pers","Suma de B_GR_Edu_AdultoM_Act","Suma de B_GR_Edu_AdultoM_Pers","Suma de B_GR_Dem_Niño_Act","Suma de B_GR_Dem_Niño_Pers","Suma de B_GR_Dem_Adoles_Act","Suma de B_GR_Dem_Adoles_Pers","Suma de B_GR_Dem_Joven_Act","Suma de B_GR_Dem_Joven_Pers","Suma de B_GR_Dem_Adulto_Act","Suma de B_GR_Dem_Adulto_Pers","Suma de B_GR_Dem_AdultoM_Act","Suma de B_GR_Dem_AdultoM_Pers","Suma de B_ATD_Niños","Suma de B_ATD_Adolesc","Suma de B_ATD_Joven","Suma de B_ATD_Adulto","Suma de B_ATD_AdultoM","Suma de B_ATD_Gest","Suma de B_ATC_Niños","Suma de B_ATC_Adolesc","Suma de B_ATC_Joven","Suma de B_ATC_Adulto","Suma de B_ATC_AdultoM","Suma de B_ATC_Gest","Suma de B_InactivaC_F_0_28d","Suma de B_InactivaC_F_29_5m","Suma de B_InactivaC_F_6_11m","Suma de B_InactivaC_F_1a","Suma de B_InactivaC_F_2a","Suma de B_InactivaC_F_3_5a","Suma de B_InactivaC_F_6_11a","Suma de B_InactivaC_F_Adolesc","Suma de B_InactivaC_F_Joven","Suma de B_InactivaC_F_Adulto","Suma de B_InactivaC_F_AdultoM","Suma de B_InactivaC_F_g","Suma de B_InactivaC_R_0_28d","Suma de B_InactivaC_R_29_5m","Suma de B_InactivaC_R_6_11m","Suma de B_InactivaC_R_1a","Suma de B_InactivaC_R_2a","Suma de B_InactivaC_R_3_5a","Suma de B_InactivaC_R_6_11a","Suma de B_InactivaC_R_Adolesc","Suma de B_InactivaC_R_Joven","Suma de B_InactivaC_R_Adulto","Suma de B_InactivaC_R_AdultoM","Suma de B_InactivaC_R_g","Suma de B_InactivaC_IV_0_28d","Suma de B_InactivaC_IV_29_5m","Suma de B_InactivaC_IV_6_11m","Suma de B_InactivaC_IV_1a","Suma de B_InactivaC_IV_2a","Suma de B_InactivaC_IV_3_5a","Suma de B_InactivaC_IV_6_11a","Suma de B_InactivaC_IV_Adolesc","Suma de B_InactivaC_IV_Joven","Suma de B_InactivaC_IV_Adulto","Suma de B_InactivaC_IV_AdultoM","Suma de B_InactivaC_IV_g","Suma de B_InterConsulHosp_0_28d","Suma de B_InterConsulHosp_29_5m","Suma de B_InterConsulHosp_6_11m","Suma de B_InterConsulHosp_1a","Suma de B_InterConsulHosp_2a","Suma de B_InterConsulHosp_3_5a","Suma de B_InterConsulHosp_6_11a","Suma de B_InterConsulHosp_Adolesc","Suma de B_InterConsulHosp_Joven","Suma de B_InterConsulHosp_Adulto","Suma de B_InterConsulHosp_AdultoM","Suma de B_InterConsulHosp_Gest","Suma de B_InterConsulAmb_0_28d","Suma de B_InterConsulAmb_29_5m","Suma de B_InterConsulAmb_6_11m","Suma de B_InterConsulAmb_1a","Suma de B_InterConsulAmb_2a","Suma de B_InterConsulAmb_3_5a","Suma de B_InterConsulAmb_6_11a","Suma de B_InterConsulAmb_Adolesc","Suma de B_InterConsulAmb_Joven","Suma de B_InterConsulAmb_Adulto","Suma de B_InterConsulAmb_AdultoM","Suma de B_InterConsulAmb_Gest","Suma de B_Referencia_0_28d","Suma de B_Referencia_29_5m","Suma de B_Referencia_6_11m","Suma de B_Referencia_1a","Suma de B_Referencia_2a","Suma de B_Referencia_3_5a","Suma de B_Referencia_6_11a","Suma de B_Referencia_Adolesc","Suma de B_Referencia_Joven","Suma de B_Referencia_Adulto","Suma de B_Referencia_AdultoM","Suma de B_Referencia_Gest","Suma de B_CReferencia_0_28d","Suma de B_CReferencia_29_5m","Suma de B_CReferencia_6_11m","Suma de B_CReferencia_1a","Suma de B_CReferencia_2a","Suma de B_CReferencia_3_5a","Suma de B_CReferencia_6_11a","Suma de B_CReferencia_Adolesc","Suma de B_CReferencia_Joven","Suma de B_CReferencia_Adulto","Suma de B_CReferencia_AdultoM","Suma de B_CReferencia_Gest","Suma de B_Monitoreo","Suma de B_Supervicion","Suma de B_Evaluacion","Suma de B_AsisTecnica","Suma de B_TeleOriSinc_0_28d","Suma de B_TeleOriSinc_29_5m","Suma de B_TeleOriSinc_6_11m","Suma de B_TeleOriSinc_1a","Suma de B_TeleOriSinc_2a","Suma de B_TeleOriSinc_3_5a","Suma de B_TeleOriSinc_6_11a","Suma de B_TeleOriSinc_Adolesc","Suma de B_TeleOriSinc_Joven","Suma de B_TeleOriSinc_Adulto","Suma de B_TeleOriSinc_AdultoM","Suma de B_TeleOriSinc_Gest","Suma de B_TeleOrisinc_ap_0_28d","Suma de B_TeleOrisinc_ap_29_5m","Suma de B_TeleOrisinc_ap_6_11m","Suma de B_TeleOrisinc_ap_1a","Suma de B_TeleOrisinc_ap_2a","Suma de B_TeleOrisinc_ap_3_5a","Suma de B_TeleOrisinc_ap_6_11a","Suma de B_TeleOrisinc_ap_Adolesc","Suma de B_TeleOrisinc_ap_Joven","Suma de B_TeleOrisinc_ap_Adulto","Suma de B_TeleOrisinc_ap_AdultoM","Suma de B_TeleOrisinc_ap_Gest","Suma de B_Telemonitoreo_0_28d","Suma de B_Telemonitoreo_29_5m","Suma de B_Telemonitoreo_6_11m","Suma de B_Telemonitoreo_1a","Suma de B_Telemonitoreo_2a","Suma de B_Telemonitoreo_3_5a","Suma de B_Telemonitoreo_6_11a","Suma de B_Telemonitoreo_Adolesc","Suma de B_Telemonitoreo_Joven","Suma de B_Telemonitoreo_Adulto","Suma de B_Telemonitoreo_AdultoM","Suma de B_Telemonitoreo_Gest","Suma de B_TSInterconsultante_0_28d","Suma de B_TSInterconsultante_29_5m","Suma de B_TSInterconsultante_6_11m","Suma de B_TSInterconsultante_1a","Suma de B_TSInterconsultante_2a","Suma de B_TSInterconsultante_3_5a","Suma de B_TSInterconsultante_6_11a","Suma de B_TSInterconsultante_Adolesc","Suma de B_TSInterconsultante_Joven","Suma de B_TSInterconsultante_Adulto","Suma de B_TSInterconsultante_AdultoM","Suma de B_TSInterconsultante_Gest","Suma de B_TSInterconsultor_0_28d","Suma de B_TSInterconsultor_29_5m","Suma de B_TSInterconsultor_6_11m","Suma de B_TSInterconsultor_1a","Suma de B_TSInterconsultor_2a","Suma de B_TSInterconsultor_3_5a","Suma de B_TSInterconsultor_6_11a","Suma de B_TSInterconsultor_Adolesc","Suma de B_TSInterconsultor_Joven","Suma de B_TSInterconsultor_Adulto","Suma de B_TSInterconsultor_AdultoM","Suma de B_TSInterconsultor_Gest"]
[1,0,0,0,0,1,0,0,0,0,0,0,0,0,0,0,3,2,0,0,0,0,0,0,0,0,0,0,0,0,0,0,0,0,0,0,0,0,0,0,0,0,0,0,0,0,0,0,0,0,0,0,0,0,0,0,0,0,0,0,1531,750,753,1159,355,165,1929,961,986,1430,430,224,0,0,0,0,0,3,0,0,0,0,0,0,0,0,0,0,0,0,0,0,0,0,0,0,0,0,0,0,0,0,0,0,0,0,0,0,0,0,0,0,0,0,0,0,0,0,0,0,0,0,0,0,0,0,0,0,0,0,0,0,0,0,0,0,0,1,0,0,0,0,1,0,0,0,0,1,1,2,2,2,1,1,1,0,0,0,0,0,0,0,0,0,0,0,0,0,0,0,0,0,0,0,0,0,0,0,0,0,0,0,0,0,0,0,0,0,0,0,0,0,0,0,0,0,0,0,0,0,0,0,0,0,0,0,0,0,0,0,0,0,0,0,0,0,0,0,0,0]
[2,0,0,0,0,0,0,0,0,0,0,0,0,0,0,0,3,0,1,0,0,0,0,0,0,0,0,0,0,0,0,0,0,0,0,0,0,0,0,0,0,0,0,0,0,0,0,0,0,0,0,0,0,0,0,0,0,0,0,0,1062,521,425,722,220,92,1540,728,630,998,321,155,0,0,0,0,0,1,0,0,0,0,0,0,0,0,0,0,0,0,0,0,0,0,0,0,0,0,0,0,0,0,0,0,0,0,0,0,1,0,0,0,0,0,0,0,0,0,0,0,0,0,0,0,0,0,0,0,0,0,0,0,0,0,0,0,0,0,0,0,0,1,0,0,0,0,0,1,0,2,2,1,0,0,0,0,0,0,0,0,0,0,0,0,0,0,0,0,0,0,0,0,0,0,0,0,0,0,0,0,0,0,0,0,0,0,0,0,0,0,0,0,0,0,0,0,0,0,0,0,0,0,0,0,0,1,0,0,0,0,0,0,0,0,0,0,0,0,0,0]
[3,0,0,0,0,0,0,0,0,0,0,0,0,0,2,1,1,1,0,0,0,0,0,0,0,0,0,0,0,0,0,0,0,0,0,0,0,0,0,0,0,0,0,0,0,0,0,0,0,0,0,0,0,0,0,0,0,0,0,0,1059,590,728,838,325,116,1528,821,1050,1114,434,228,0,0,0,0,0,0,0,0,0,0,0,0,0,0,0,0,0,0,0,0,0,0,0,0,0,0,0,0,0,0,0,0,0,0,0,0,0,0,0,0,0,0,0,0,1,0,0,0,0,0,0,0,0,0,0,0,0,0,0,0,0,0,0,0,0,1,1,0,1,0,0,0,0,0,0,0,0,0,1,0,0,0,0,0,0,0,0,0,0,0,0,0,0,0,0,0,0,0,0,0,0,0,0,0,0,0,0,0,0,0,0,0,0,0,0,0,0,0,0,0,0,0,0,0,0,0,0,0,0,0,0,0,0,0,0,0,0,0,0,0,0,0,0,0,0,0,0,0]
[4,0,0,0,0,0,0,0,0,0,0,0,0,0,0,0,4,1,0,0,0,0,0,0,0,0,0,0,0,0,0,0,0,0,0,0,0,0,0,0,0,0,0,0,0,0,0,0,0,0,0,0,0,0,0,0,0,0,0,0,3285,1246,590,964,350,172,3890,1419,857,1279,450,314,0,0,0,0,0,0,0,0,0,0,0,0,0,0,0,0,0,0,0,0,0,0,0,0,0,0,0,0,0,0,0,0,0,0,0,0,0,0,0,0,0,0,0,0,0,0,0,0,0,0,0,0,0,0,0,0,0,0,0,0,0,0,0,0,0,0,0,0,0,0,0,0,0,0,0,0,0,2,1,0,0,0,0,0,0,0,0,0,0,0,0,0,0,0,0,0,0,0,0,0,0,0,0,0,0,0,0,0,0,0,0,0,0,0,0,0,0,0,0,0,0,0,0,0,0,0,0,0,0,0,0,0,0,0,0,0,0,0,0,0,0,0,0,0,0,0,0,0]
[5,0,0,0,0,0,0,0,0,0,0,0,0,0,0,0,2,0,0,0,0,0,0,0,0,0,0,0,0,0,0,0,0,0,0,0,0,0,0,0,0,0,0,0,0,0,0,0,0,0,0,0,0,0,0,0,0,0,0,0,1474,507,396,579,195,92,1896,642,596,860,283,190,0,0,0,0,0,0,0,0,0,0,0,0,0,0,0,0,0,0,0,0,0,0,0,0,0,0,0,0,0,0,0,0,0,0,0,0,0,0,0,0,0,0,0,0,0,0,0,0,0,0,0,0,0,0,0,0,0,0,0,0,0,0,0,0,0,1,0,1,0,0,0,0,1,0,0,0,0,1,0,0,0,0,0,0,0,0,0,0,0,0,0,0,0,0,0,0,0,0,0,0,0,0,0,0,0,0,0,0,0,0,0,0,0,0,0,0,0,0,0,0,0,0,0,0,0,0,0,0,0,0,0,0,0,0,0,0,0,0,0,0,0,0,0,0,0,0,0,0]
[6,0,0,0,0,0,0,2,0,0,0,0,0,0,0,0,2,0,1,0,0,0,0,0,0,0,0,0,0,0,0,0,0,0,0,0,0,0,0,0,0,0,0,0,0,0,0,0,0,0,0,0,0,0,0,0,0,0,0,0,1548,392,477,868,305,123,2424,607,733,1216,467,244,0,0,0,0,0,0,0,0,0,0,0,0,0,0,0,0,0,0,0,0,0,0,0,0,0,0,0,0,0,0,0,0,0,0,0,0,0,0,0,0,0,1,1,0,0,0,0,0,0,0,0,0,0,0,0,0,0,0,0,0,0,0,0,0,1,0,0,0,0,1,0,0,0,0,0,0,1,1,0,0,0,0,0,0,0,0,0,0,0,0,0,0,0,0,0,0,0,0,0,0,0,0,0,0,0,0,0,0,0,0,0,0,0,0,0,0,0,0,0,0,0,0,0,0,0,0,0,0,0,0,0,0,0,0,0,0,0,0,0,0,0,0,0,0,0,0,0,0]
[7,1,1,1,0,1,0,1,0,0,0,0,0,0,0,0,3,3,1,0,0,0,0,0,0,0,0,0,0,0,0,0,0,0,0,0,0,0,0,0,0,0,0,0,0,0,0,0,0,0,0,0,0,0,0,0,0,0,0,0,1615,903,430,745,241,121,2249,1086,706,1130,396,244,0,0,0,0,0,0,2,0,0,0,0,0,0,0,0,0,0,0,0,0,0,0,0,0,0,0,0,0,0,0,0,0,0,0,0,0,0,0,0,0,0,0,0,0,0,0,0,0,0,0,0,0,0,0,0,0,0,0,0,0,0,0,0,0,0,0,0,0,0,0,0,0,1,0,0,0,0,2,0,0,0,0,0,0,0,0,0,0,0,0,0,0,0,0,0,0,0,0,0,0,0,0,0,0,0,0,0,0,0,0,0,0,0,0,0,0,0,0,0,0,0,0,0,0,0,0,0,0,0,0,0,0,0,0,0,0,0,0,0,0,0,0,0,0,0,0,0,0]
[8,0,0,0,0,0,0,1,0,0,0,0,0,0,0,1,2,2,2,0,0,0,0,0,0,0,0,0,0,0,0,0,0,0,0,0,0,0,0,0,0,0,0,0,0,0,0,0,0,0,0,0,0,0,0,0,0,0,0,0,965,655,450,652,279,124,1843,956,698,1062,438,212,0,0,0,0,0,2,0,0,0,0,0,0,0,0,0,0,0,0,0,0,0,0,0,0,0,0,0,0,0,0,0,0,0,0,0,0,0,0,0,0,0,0,1,0,0,0,3,0,0,0,0,0,0,0,0,0,0,0,0,0,0,0,0,0,0,2,0,0,0,2,2,0,0,0,0,0,1,0,0,0,0,0,0,1,0,0,0,0,0,0,0,0,0,0,0,0,0,0,0,0,0,0,0,0,0,0,0,0,0,0,0,0,0,0,0,0,0,0,0,0,0,0,0,0,0,0,0,0,0,0,0,0,0,0,0,0,0,0,0,0,0,0,0,0,0,0,0,0]
[9,0,0,0,0,1,0,1,0,0,0,0,0,0,0,0,0,0,0,0,0,0,0,0,0,0,0,0,0,0,0,0,0,0,0,0,0,0,0,0,0,0,0,0,0,0,0,0,0,0,0,0,0,0,0,0,0,0,0,0,956,352,403,746,261,96,2285,681,680,1088,422,195,0,0,0,0,0,0,0,0,0,0,0,0,0,0,0,0,0,0,0,0,0,0,0,0,0,0,0,0,0,0,0,0,0,0,0,0,0,0,0,0,0,0,0,0,2,0,0,2,0,0,0,0,0,0,0,0,0,0,0,0,0,0,0,0,0,0,1,0,0,0,0,0,0,0,0,0,0,1,0,0,0,0,0,0,0,0,0,0,0,0,0,0,0,0,0,0,0,0,0,0,0,0,0,0,0,0,0,0,0,0,0,0,0,0,0,0,0,0,0,0,0,0,0,0,0,0,0,0,0,0,0,0,0,0,0,0,0,0,0,0,0,0,0,0,0,0,0,0]
[10,0,2,0,0,0,0,0,0,0,0,0,0,0,0,0,0,1,0,0,0,0,0,0,0,0,0,0,0,0,0,0,0,0,0,0,0,0,0,0,0,0,0,0,0,0,0,0,0,0,0,0,0,0,0,0,0,0,0,0,1004,265,466,675,228,83,2580,636,792,1114,362,174,0,0,0,0,0,0,0,0,0,0,0,0,0,0,0,0,0,0,0,0,0,0,0,0,0,0,0,0,0,0,0,0,0,0,0,0,1,0,0,0,0,0,1,0,2,2,1,0,0,0,0,0,0,0,0,0,0,0,0,0,0,0,0,0,0,1,0,0,0,0,0,0,0,0,0,0,0,1,0,0,0,1,0,0,0,0,0,0,0,0,0,0,0,0,0,0,0,0,0,0,0,0,0,0,0,0,0,0,0,0,0,0,0,0,0,0,0,0,0,0,0,0,0,0,0,0,0,0,0,0,0,0,0,0,0,0,0,0,0,0,0,0,0,0,0,0,0,0]
[11,1,0,0,0,1,0,2,0,0,0,0,0,0,0,0,1,2,3,0,0,0,0,0,0,0,0,0,0,0,0,0,0,0,0,0,0,0,0,0,0,0,0,0,0,0,0,0,0,0,0,0,0,0,0,0,0,0,0,0,662,275,326,582,219,93,2334,843,577,942,327,189,0,0,0,0,0,0,0,0,0,0,0,0,0,0,0,0,0,0,0,0,0,0,0,0,0,0,0,0,0,0,0,0,0,0,0,0,0,0,0,0,0,0,0,1,1,0,4,0,0,0,0,0,0,0,0,0,0,0,0,0,0,0,0,0,0,0,0,0,0,0,0,0,0,0,0,0,0,2,0,0,1,1,2,0,0,0,0,0,0,0,0,0,0,0,0,0,0,0,0,0,0,0,0,0,0,0,0,0,0,0,0,0,0,0,0,0,0,0,0,0,0,0,0,0,0,0,0,0,0,0,0,0,0,0,0,0,0,0,0,0,0,0,0,0,0,0,0,0]
["Total general",2,3,1,0,4,0,7,0,0,0,0,0,0,2,2,21,12,8,0,0,0,0,0,0,0,0,0,0,0,0,0,0,0,0,0,0,0,0,0,0,0,0,0,0,0,0,0,0,0,0,0,0,0,0,0,0,0,0,0,15161,6456,5444,8530,2978,1277,24498,9380,8305,12233,4330,2369,0,0,0,0,0,6,2,0,0,0,0,0,0,0,0,0,0,0,0,0,0,0,0,0,0,0,0,0,0,0,0,0,0,0,0,0,2,0,0,0,0,1,3,1,6,2,8,2,0,0,0,0,0,0,0,0,0,0,0,0,0,0,0,0,1,6,2,1,1,4,3,0,2,0,0,2,3,14,6,3,2,3,3,1,0,0,0,0,0,0,0,0,0,0,0,0,0,0,0,0,0,0,0,0,0,0,0,0,0,0,0,0,0,0,0,0,0,0,0,0,0,0,0,0,0,0,0,0,0,0,0,0,0,1,0,0,0,0,0,0,0,0,0,0,0,0,0,0]
[]
[]
[]
[]
[]
["Salud Bucal 4"]
["Anio",2024]
["UE","(Todas)"]
["Red","LA CONVENCION"]
["MicroRed","(Todas)"]
["EESS","(Todas)"]
["Provincia","(Todas)"]
["Distrito","(Todas)"]
[]
["Etiquetas de fila","Suma de B_ANCEDN_CT_0_28d","Suma de B_ANCEDN_CT_29_5m","Suma de B_ANCEDN_CT_6_11m","Suma de B_ANCEDN_CT_1a","Suma de B_ANCEDN_CT_2a","Suma de B_ANCEDN_CT_3_5a","Suma de B_ANCEDN_CT_6_11a","Suma de B_ANCEDN_CT_Adolesc","Suma de B_ANCEDN_CT_Joven","Suma de B_ANCEDN_CT_Adulto","Suma de B_ANCEDN_CT_AdultoM","Suma de B_ANCEDN_CT_6_11a_g","Suma de B_ANCEDN_CT_Adol_g","Suma de B_ANCEDN_CT_Joven_g","Suma de B_ANCEDN_CT_Adulto_g","Suma de B_EXODONN_CT_0_28d","Suma de B_EXODONN_CT_29_5m","Suma de B_EXODONN_CT_6_11m","Suma de B_EXODONN_CT_1a","Suma de B_EXODONN_CT_2a","Suma de B_EXODONN_CT_3_5a","Suma de B_EXODONN_CT_6_11a","Suma de B_EXODONN_CT_Adolesc","Suma de B_EXODONN_CT_Joven","Suma de B_EXODONN_CT_Adulto","Suma de B_EXODONN_CT_AdultoM","Suma de B_EXODONN_CT_6_11a_g","Suma de B_EXODONN_CT_Adol_g","Suma de B_EXODONN_CT_Joven_g","Suma de B_EXODONN_CT_Adulto_g","Suma de B_IHON_CT_6_11m","Suma de B_IHON_CT_1a","Suma de B_IHON_CT_2a","Suma de B_IHON_CT_3_5a","Suma de B_IHON_CT_6_11a","Suma de B_IHON_CT_Adolesc","Suma de B_IHON_CT_Joven","Suma de B_IHON_CT_Adulto","Suma de B_IHON_CT_AdultoM","Suma de B_IHON_CT_6_11a_g","Suma de B_IHON_CT_Adol_g","Suma de B_IHON_CT_Joven_g","Suma de B_IHON_CT_Adulto_g","Suma de B_ASELN_CT_2a","Suma de B_ASELN_CT_3_5a","Suma de B_ASELN_CT_6_11a","Suma de B_ASELN_CT_Adolesc","Suma de B_ASELN_CT_Joven","Suma de B_ASELN_CT_Adulto","Suma de B_ASELN_CT_AdultoM","Suma de B_ASELN_CT_6_11a_g","Suma de B_ASELN_CT_Adol_g","Suma de B_ASELN_CT_Joven_g","Suma de B_ASELN_CT_Adulto_g","Suma de B_ABFN_CT_6_11m","Suma de B_ABFN_CT_1a","Suma de B_ABFN_CT_2a","Suma de B_ABFN_CT_3_5a","Suma de B_ABFN_CT_6_11a","Suma de B_ABFN_CT_Adolesc","Suma de B_ABFN_CT_Joven","Suma de B_ABFN_CT_Adulto","Suma de B_ABFN_CT_AdultoM","Suma de B_ABFN_CT_6_11a_g","Suma de B_ABFN_CT_Adol_g","Suma de B_ABFN_CT_Joven_g","Suma de B_ABFN_CT_Adulto_g","Suma de B_AFGN_CT_Adulto","Suma de B_AFGN_CT_AdultoM","Suma de B_AFGN_CT_6_11a_g","Suma de B_AFGN_CT_Adol_g","Suma de B_AFGN_CT_Joven_g","Suma de B_AFGN_CT_Adulto_g","Suma de B_PDN_CT_6_11m","Suma de B_PDN_CT_1a","Suma de B_PDN_CT_2a","Suma de B_PDN_CT_3_5a","Suma de B_PDN_CT_6_11a","Suma de B_PDN_CT_Adolesc","Suma de B_PDN_CT_Joven","Suma de B_PDN_CT_Adulto","Suma de B_PDN_CT_AdultoM","Suma de B_PDN_CT_6_11a_g","Suma de B_PDN_CT_Adol_g","Suma de B_PDN_CT_Joven_g","Suma de B_PDN_CT_Adulto_g","Suma de B_DestartrajeN_CT_0_28d","Suma de B_DestartrajeN_CT_29_5m","Suma de B_DestartrajeN_CT_6_11m","Suma de B_DestartrajeN_CT_1a","Suma de B_DestartrajeN_CT_2a","Suma de B_DestartrajeN_CT_3_5a","Suma de B_DestartrajeN_CT_6_11a","Suma de B_DestartrajeN_CT_Adolesc","Suma de B_DestartrajeN_CT_Joven","Suma de B_DestartrajeN_CT_Adulto","Suma de B_DestartrajeN_CT_AdultoM","Suma de B_DestartrajeN_CT_6_11a_g","Suma de B_DestartrajeN_CT_Adol_g","Suma de B_DestartrajeN_CT_Joven_g","Suma de B_DestartrajeN_CT_Adulto_g","Suma de B_Debridacion_BucodenN_0_28d","Suma de B_Debridacion_BucodenN_29_5m","Suma de B_Debridacion_BucodenN_6_11m","Suma de B_Debridacion_BucodenN_1a","Suma de B_Debridacion_BucodenN_2a","Suma de B_Debridacion_BucodenN_3_5a","Suma de B_Debridacion_BucodenN_6_11a","Suma de B_Debridacion_BucodenN_Adolesc","Suma de B_Debridacion_BucodenN_Joven","Suma de B_Debridacion_BucodenN_Adulto","Suma de B_Debridacion_BucodenN_AdultoM","Suma de B_Debridacion_BucodenN_6_11a_g","Suma de B_Debridacion_BucodenN_Adol_g","Suma de B_Debridacion_BucodenN_Joven_g","Suma de B_Debridacion_BucodenN_Adulto_g","Suma de B_Consulta_EstomatoN_0_28d","Suma de B_Consulta_EstomatoN_29_5m","Suma de B_Consulta_EstomatoN_6_11m","Suma de B_Consulta_EstomatoN_1a","Suma de B_Consulta_EstomatoN_2a","Suma de B_Consulta_EstomatoN_3_5a","Suma de B_Consulta_EstomatoN_6_11a","Suma de B_Consulta_EstomatoN_Adolesc","Suma de B_Consulta_EstomatoN_Joven","Suma de B_Consulta_EstomatoN_Adulto","Suma de B_Consulta_EstomatoN_AdultoM","Suma de B_Consulta_EstomatoN_6_11a_g","Suma de B_Consulta_EstomatoN_Adol_g","Suma de B_Consulta_EstomatoN_Joven_g","Suma de B_Consulta_EstomatoN_Adulto_g","Suma de B_Exodoncia_SimpleN_I_0_28d","Suma de B_Exodoncia_SimpleN_I_29_5m","Suma de B_Exodoncia_SimpleN_I_6_11m","Suma de B_Exodoncia_SimpleN_I_1a","Suma de B_Exodoncia_SimpleN_I_2a","Suma de B_Exodoncia_SimpleN_I_3_5a","Suma de B_Exodoncia_SimpleN_I_6_11a","Suma de B_Exodoncia_SimpleN_I_Adolesc","Suma de B_Exodoncia_SimpleN_I_Joven","Suma de B_Exodoncia_SimpleN_I_Adulto","Suma de B_Exodoncia_SimpleN_I_AdultoM","Suma de B_Exodoncia_SimpleN_I_6_11a_g","Suma de B_Exodoncia_SimpleN_I_Adol_g","Suma de B_Exodoncia_SimpleN_I_Joven_g","Suma de B_Exodoncia_SimpleN_I_Adulto_g","Suma de B_Ionomero_VidrioN_I_6_11m","Suma de B_Ionomero_VidrioN_I_1a","Suma de B_Ionomero_VidrioN_I_2a","Suma de B_Ionomero_VidrioN_I_3_5a","Suma de B_Ionomero_VidrioN_I_6_11a","Suma de B_Ionomero_VidrioN_I_Adolesc","Suma de B_Ionomero_VidrioN_I_Joven","Suma de B_Ionomero_VidrioN_I_Adulto","Suma de B_Ionomero_VidrioN_I_AdultoM","Suma de B_Ionomero_VidrioN_I_6_11a_g","Suma de B_Ionomero_VidrioN_I_Adol_g","Suma de B_Ionomero_VidrioN_I_Joven_g","Suma de B_Ionomero_VidrioN_I_Adulto_g","Suma de B_ResinaN_I_6_11m","Suma de B_ResinaN_I_1a","Suma de B_ResinaN_I_2a","Suma de B_ResinaN_I_3_5a","Suma de B_ResinaN_I_6_11a","Suma de B_ResinaN_I_Adolesc","Suma de B_ResinaN_I_Joven","Suma de B_ResinaN_I_Adulto","Suma de B_ResinaN_I_AdultoM","Suma de B_ResinaN_I_6_11a_g","Suma de B_ResinaN_I_Adol_g","Suma de B_ResinaN_I_Joven_g","Suma de B_ResinaN_I_Adulto_g","Suma de B_PulpotomiaN_I_6_11m","Suma de B_PulpotomiaN_I_1a","Suma de B_PulpotomiaN_I_2a","Suma de B_PulpotomiaN_I_3_5a","Suma de B_PulpotomiaN_I_6_11a","Suma de B_PulpotomiaN_I_Adolesc","Suma de B_PulpotomiaN_I_Joven","Suma de B_PulpotomiaN_I_Adulto","Suma de B_PulpotomiaN_I_AdultoM","Suma de B_PulpotomiaN_I_6_11a_g","Suma de B_PulpotomiaN_I_Adol_g","Suma de B_PulpotomiaN_I_Joven_g","Suma de B_PulpotomiaN_I_Adulto_g","Suma de B_TEndodonticaN_TA_6_11m","Suma de B_TEndodonticaN_TA_1a","Suma de B_TEndodonticaN_TA_2a","Suma de B_TEndodonticaN_TA_3_5a","Suma de B_TEndodonticaN_TA_6_11a","Suma de B_TEndodonticaN_TA_Adolesc","Suma de B_TEndodonticaN_TA_Joven","Suma de B_TEndodonticaN_TA_Adulto","Suma de B_TEndodonticaN_TA_AdultoM","Suma de B_TEndodonticaN_TA_6_11a_g","Suma de B_TEndodonticaN_TA_Adol_g","Suma de B_TEndodonticaN_TA_Joven_g","Suma de B_TEndodonticaN_TA_Adulto_g","Suma de B_OrtopediaMaxilarN_in_6_11m","Suma de B_OrtopediaMaxilarN_in_1a","Suma de B_OrtopediaMaxilarN_in_2a","Suma de B_OrtopediaMaxilarN_in_3_5a","Suma de B_OrtopediaMaxilarN_in_6_11a","Suma de B_OrtopediaMaxilarN_in_Adolesc","Suma de B_OrtopediaMaxilarN_in_Joven","Suma de B_OrtopediaMaxilarN_in_Adulto","Suma de B_OrtopediaMaxilarN_in_AdultoM","Suma de B_OrtopediaMaxilarN_in_6_11a_g","Suma de B_OrtopediaMaxilarN_in_Adol_g","Suma de B_OrtopediaMaxilarN_in_Joven_g","Suma de B_OrtopediaMaxilarN_in_Adulto_g","Suma de B_RehabProtesicaN_in_3_5a","Suma de B_RehabProtesicaN_in_6_11a","Suma de B_RehabProtesicaN_in_Adolesc","Suma de B_RehabProtesicaN_in_Joven","Suma de B_RehabProtesicaN_in_Adulto","Suma de B_RehabProtesicaN_in_AdultoM","Suma de B_RehabProtesicaN_in_6_11a_g","Suma de B_RehabProtesicaN_in_Adol_g","Suma de B_RehabProtesicaN_in_Joven_g","Suma de B_RehabProtesicaN_in_Adulto_g","Suma de B_TtoPeriodontalN_3_5a","Suma de B_TtoPeriodontalN_6_11a","Suma de B_TtoPeriodontalN_Adolesc","Suma de B_TtoPeriodontalN_Joven","Suma de B_TtoPeriodontalN_Adulto","Suma de B_TtoPeriodontalN_AdultoM","Suma de B_TtoPeriodontalN_6_11a_g","Suma de B_TtoPeriodontalN_Adol_g","Suma de B_TtoPeriodontalN_Joven_g","Suma de B_TtoPeriodontalN_Adulto_g","Suma de B_MaxiloFacialN_I_0_28d","Suma de B_MaxiloFacialN_I_29_5m","Suma de B_MaxiloFacialN_I_6_11m","Suma de B_MaxiloFacialN_I_1a","Suma de B_MaxiloFacialN_I_2a","Suma de B_MaxiloFacialN_3_5a","Suma de B_MaxiloFacialN_6_11a","Suma de B_MaxiloFacialN_Adolesc","Suma de B_MaxiloFacialN_Joven","Suma de B_MaxiloFacialN_Adulto","Suma de B_MaxiloFacialN_AdultoM","Suma de B_MaxiloFacialN_6_11a_g","Suma de B_MaxiloFacialN_Adol_g","Suma de B_MaxiloFacialN_Joven_g","Suma de B_MaxiloFacialN_Adulto_g"]
[1,0,0,1,0,2,10,12,8,12,8,3,0,2,3,2,3,6,17,17,16,137,241,201,203,308,104,2,5,84,62,1,0,2,10,12,8,12,8,3,0,2,3,2,0,3,17,3,0,0,0,2,0,0,0,1,0,2,19,33,17,12,0,1,0,1,5,1,17,3,0,1,1,1,0,0,2,17,33,19,19,14,4,0,2,5,1,0,0,0,0,0,0,6,33,39,71,29,0,0,23,24,0,0,0,0,0,4,10,10,5,10,2,0,0,1,0,0,0,0,3,2,43,91,50,86,118,48,0,0,3,6,0,0,0,0,0,4,85,37,58,114,67,0,0,4,2,0,0,0,73,48,17,20,39,3,0,0,11,6,0,1,15,100,254,379,270,311,45,0,6,80,53,0,0,2,10,9,36,27,26,5,0,0,2,0,0,0,2,10,0,0,0,0,0,0,0,0,0,0,0,0,0,0,0,0,0,0,0,0,0,0,0,0,0,0,0,0,0,0,0,0,0,0,0,0,1,0,0,0,0,0,0,0,0,0,0,0,0,0,3,1,0,0,0,0,0]
[2,0,0,0,1,0,11,25,11,6,8,2,0,0,11,7,1,1,2,17,15,107,177,150,120,186,66,1,14,39,32,0,1,0,11,25,11,6,8,2,0,0,10,7,0,2,12,2,0,0,0,0,0,0,0,0,1,1,13,24,9,9,0,0,0,0,13,10,18,2,0,0,4,2,0,1,1,13,25,12,20,12,2,0,0,17,9,0,0,0,0,0,1,1,23,25,47,16,0,2,19,13,0,0,0,0,1,4,3,0,4,2,0,0,0,0,0,1,0,0,0,3,27,63,44,48,71,26,0,0,8,3,0,0,0,0,0,15,85,31,36,66,49,0,0,3,2,0,0,2,69,56,18,16,36,10,0,1,9,1,0,0,3,104,225,280,176,251,32,0,9,57,40,0,0,0,4,27,42,10,16,8,0,1,3,2,0,0,0,1,0,0,1,0,0,0,0,0,0,0,0,0,0,0,0,0,0,0,0,0,0,0,0,0,0,0,0,0,0,0,0,0,0,0,0,0,0,0,0,0,0,0,0,0,0,0,0,0,0,0,3,0,1,0,0,0,0]
[3,0,0,1,2,1,12,26,11,13,9,9,0,4,22,19,0,3,14,18,14,102,190,183,220,253,102,0,6,57,41,1,2,1,12,26,11,13,9,9,0,4,21,19,0,5,9,2,0,0,0,0,0,0,0,1,1,3,18,35,11,19,3,0,0,4,24,19,22,13,0,0,4,2,0,1,3,15,33,21,26,21,13,0,4,27,22,0,0,0,0,0,1,3,17,46,69,34,0,2,26,9,0,0,0,0,0,5,1,3,3,11,2,0,0,1,0,0,0,0,0,1,30,30,45,82,98,48,0,0,7,3,0,0,0,0,0,15,77,39,77,106,52,0,1,5,5,0,0,1,77,69,28,18,8,3,0,0,5,2,0,0,3,104,198,255,270,251,55,0,8,98,70,0,0,0,5,13,21,13,16,1,0,1,0,1,0,0,0,9,5,1,0,1,0,0,0,0,0,0,0,0,0,0,0,0,0,0,0,0,0,0,0,0,0,0,0,0,0,0,0,0,0,0,0,0,0,0,0,0,0,0,0,0,0,0,0,0,2,1,1,1,0,0,0,0,0]
[4,0,0,6,7,3,48,59,19,19,30,9,0,3,37,35,2,0,29,31,30,278,749,404,170,277,110,10,19,75,43,6,7,3,49,60,19,20,29,10,0,3,37,35,0,4,19,3,0,0,0,1,0,0,0,3,7,4,62,72,21,23,10,2,0,2,37,31,22,8,0,1,2,7,3,5,5,63,79,19,27,32,11,0,3,39,33,0,0,0,0,0,1,4,51,47,63,25,0,7,44,26,0,0,0,0,0,7,6,3,3,8,1,0,0,0,0,0,0,0,1,1,29,50,25,64,95,36,0,1,16,8,0,0,0,0,0,8,77,45,65,115,49,3,1,6,6,0,1,0,76,29,11,15,15,10,0,0,9,6,0,1,6,112,197,199,256,266,56,12,30,124,72,0,0,0,4,22,10,13,18,1,12,0,8,2,0,0,0,17,0,0,0,0,0,0,0,0,0,0,0,0,0,0,0,0,0,0,0,0,0,0,0,0,0,0,0,0,0,0,0,0,0,0,0,0,0,0,0,0,0,0,0,0,0,0,0,0,0,0,4,0,0,0,0,0,0]
[5,0,0,1,2,4,20,28,21,21,21,8,0,6,28,26,0,0,21,14,22,227,190,140,108,171,62,1,5,47,26,1,2,4,20,29,21,21,21,8,0,6,28,26,0,7,8,0,0,0,0,0,0,0,0,1,1,6,30,33,20,23,8,3,0,7,29,26,23,6,0,0,1,1,0,0,5,28,35,24,23,28,10,0,7,31,27,0,0,0,1,0,2,1,12,31,59,20,0,2,25,18,0,0,0,0,0,4,5,2,5,13,1,0,0,0,0,0,0,0,0,1,21,35,37,54,81,35,0,0,2,0,0,0,0,0,0,8,61,28,43,69,50,1,0,5,4,0,0,0,216,38,13,7,8,2,0,1,1,5,1,1,6,115,115,145,150,197,40,0,16,76,51,0,0,0,3,3,4,7,6,1,0,1,0,0,0,0,0,4,1,0,0,0,0,0,0,0,0,0,0,0,0,0,0,0,0,0,0,0,0,0,0,0,0,0,0,0,0,0,0,0,0,0,0,0,0,0,0,0,0,0,0,0,0,0,0,0,0,0,2,0,0,0,0,0,0]
[6,0,0,1,1,1,25,93,9,10,4,3,0,1,10,6,0,2,1,19,20,88,125,83,79,140,50,1,1,27,28,1,1,1,26,93,9,10,4,3,0,1,10,6,1,2,9,0,0,0,0,0,0,0,0,1,2,3,37,108,10,6,0,2,0,1,11,5,6,3,0,0,0,5,1,2,4,38,108,30,19,4,7,0,1,11,5,0,0,0,0,0,0,0,9,10,41,10,0,0,10,14,0,0,0,0,0,2,0,3,2,5,3,0,0,0,0,0,0,0,1,4,23,21,25,34,46,22,0,0,2,1,0,0,0,0,1,10,59,17,34,55,26,0,0,0,0,0,0,11,57,50,9,7,10,6,2,0,2,2,0,1,5,71,149,97,145,146,35,0,8,45,24,0,0,0,0,2,2,3,2,0,0,0,2,0,0,0,0,2,0,0,2,0,0,0,0,0,0,0,0,0,0,0,0,0,0,0,0,0,0,0,0,0,0,0,0,0,0,0,0,0,0,0,0,0,0,0,0,0,0,2,0,0,0,0,0,0,0,0,2,0,1,0,0,0,0]
[7,0,0,0,0,2,7,14,17,6,8,1,0,3,8,8,1,0,1,3,6,41,51,97,49,69,28,0,2,17,13,0,0,2,7,14,17,7,8,1,0,3,8,8,0,2,1,3,0,0,0,0,0,0,0,0,1,2,8,17,12,9,2,0,0,2,10,7,12,3,0,0,0,4,0,1,2,8,16,17,17,15,6,0,3,11,7,0,0,0,0,0,4,2,4,8,10,6,0,3,16,11,0,0,0,0,0,3,3,6,6,5,1,0,0,0,0,1,0,0,0,2,18,10,18,29,42,23,0,0,2,1,0,0,0,0,0,6,22,8,20,56,35,0,0,2,0,0,0,2,45,53,143,3,10,0,0,2,3,3,0,0,2,44,54,75,88,102,21,0,5,35,21,0,0,0,1,4,7,13,11,1,0,0,0,0,0,0,0,4,0,4,0,0,0,0,0,0,0,0,0,0,0,0,0,0,0,0,0,0,0,0,0,0,0,0,0,0,0,0,0,0,0,1,1,0,1,0,0,0,0,1,0,0,0,0,0,0,0,0,2,1,0,0,0,0,0]
[8,0,0,0,1,1,5,77,19,6,1,5,0,0,5,8,1,0,2,5,4,17,58,29,64,69,17,0,3,12,16,0,1,1,5,77,19,6,1,5,0,0,5,8,0,0,1,0,0,0,0,0,0,0,0,0,1,0,6,66,18,4,0,0,0,0,11,6,14,5,0,0,0,2,0,1,0,7,76,21,13,13,9,0,0,11,6,0,0,0,0,0,1,2,5,12,20,5,0,2,7,7,0,0,0,0,0,2,2,5,6,10,1,0,0,0,0,0,0,0,1,1,10,28,27,35,54,22,0,0,2,3,0,0,0,0,0,3,24,11,18,47,31,0,0,3,0,0,0,1,21,24,6,8,11,0,0,0,0,1,0,0,0,36,70,85,119,88,11,0,3,17,14,0,0,0,2,5,17,9,9,2,0,0,0,1,0,0,0,1,0,0,0,0,0,0,0,0,1,0,0,0,0,0,0,0,0,0,0,0,0,0,0,0,0,0,0,0,0,0,0,0,0,0,0,0,0,0,0,0,0,1,0,0,0,0,0,0,0,0,2,1,1,0,0,0,0]
[9,0,0,2,4,1,25,142,6,10,15,6,0,1,8,11,0,0,2,4,10,30,71,49,58,117,50,0,2,20,18,2,4,0,25,142,6,10,15,7,0,1,8,11,0,7,11,1,0,0,0,0,0,0,0,2,4,2,30,147,6,9,5,0,0,1,9,10,25,8,0,0,1,2,2,3,2,32,147,10,17,32,9,0,1,11,10,0,0,0,0,1,2,2,10,11,27,19,0,2,11,6,0,0,0,0,1,4,5,9,6,10,1,0,0,0,1,0,0,0,2,1,18,34,26,43,64,34,0,0,1,7,0,0,0,0,0,7,42,23,29,74,40,0,0,0,2,0,0,0,47,22,9,7,8,0,0,0,1,1,0,1,2,51,89,64,109,140,38,0,5,24,18,0,0,0,2,8,6,5,16,10,0,0,4,10,0,0,0,0,0,0,0,0,0,0,0,0,0,0,0,0,0,0,0,0,0,0,0,0,0,0,0,0,0,0,0,0,0,0,0,0,0,0,0,0,1,0,0,0,0,1,0,0,0,0,0,0,0,0,0,0,0,0,0,0,0]
[10,0,0,3,10,5,73,217,76,23,28,9,0,1,12,10,0,10,13,11,17,79,141,67,104,149,60,0,1,30,21,3,10,5,73,217,76,23,29,8,0,1,12,10,0,5,12,2,0,0,0,0,0,0,0,3,10,6,79,253,82,22,3,0,0,1,13,10,31,9,0,0,0,3,3,7,5,53,236,81,30,33,9,0,1,14,11,0,0,0,0,0,1,2,3,29,39,22,0,0,25,16,0,0,0,0,0,2,8,4,11,8,0,0,0,0,0,3,0,0,0,1,30,59,30,53,113,38,0,0,4,6,0,0,0,0,0,11,66,32,48,95,51,0,0,9,6,0,0,4,49,102,10,13,15,3,0,0,2,0,0,0,0,99,159,127,167,160,37,0,5,37,28,0,0,0,4,4,10,19,18,3,0,0,0,3,0,0,0,0,1,0,0,0,0,0,0,0,0,0,0,0,0,0,0,0,0,0,0,0,0,0,0,0,0,0,0,0,0,0,0,0,0,2,0,0,0,0,0,0,0,0,0,0,0,0,0,0,0,0,0,1,0,0,0,0,0]
[11,0,7,1,5,2,119,290,171,31,35,11,0,1,20,16,0,2,3,8,11,62,75,76,73,147,50,0,4,23,27,1,5,2,117,287,171,31,35,10,0,1,19,17,0,4,54,1,0,0,0,0,0,0,0,1,3,3,135,291,166,33,9,0,0,1,23,16,27,14,0,0,0,2,1,5,4,140,264,148,35,41,14,0,1,23,15,0,0,0,0,0,1,4,17,21,42,6,0,0,18,18,0,0,0,0,0,1,4,4,6,5,0,0,0,1,0,1,0,1,1,0,23,42,33,35,75,24,0,0,2,9,0,0,0,0,0,9,71,39,45,104,53,0,1,0,2,0,0,4,102,103,10,6,9,3,0,0,0,0,1,0,1,73,130,135,135,170,19,0,0,32,24,0,0,0,11,22,11,10,19,0,0,0,1,3,0,0,0,4,0,0,0,0,0,0,0,0,0,0,0,0,0,0,0,0,0,0,0,0,0,0,0,0,0,0,0,0,0,0,0,0,1,0,0,0,1,0,0,0,0,2,0,0,0,0,0,0,0,0,1,2,3,0,0,0,0]
["Total general",0,7,16,33,22,355,983,368,157,167,66,0,22,164,148,8,24,105,147,165,1168,2068,1479,1248,1886,699,15,62,431,327,16,33,21,355,982,368,159,167,66,0,22,161,149,1,41,153,17,0,0,0,3,0,0,0,13,31,32,437,1079,372,169,40,8,0,20,185,141,217,74,0,2,13,31,10,26,33,414,1052,402,246,245,94,0,23,200,146,0,0,0,1,1,14,27,184,279,488,192,0,20,224,162,0,0,0,0,2,38,47,49,57,87,12,0,0,3,1,6,0,1,9,17,272,463,360,563,857,356,0,1,49,47,0,0,0,0,1,96,669,310,473,901,503,4,3,37,29,0,1,25,832,594,274,120,169,40,2,4,43,27,2,5,43,909,1640,1841,1885,2082,389,12,95,625,415,0,0,2,46,119,166,129,157,32,12,3,20,22,0,0,2,52,7,5,3,1,0,0,0,0,1,0,0,0,0,0,0,0,0,0,0,0,0,0,0,0,0,0,0,0,0,0,0,0,1,3,1,0,4,0,0,0,0,7,0,0,0,0,0,0,2,1,20,7,6,0,0,0,0]
[]
[]
[]
[]
["Salud Bucal 5"]
[]
["Anio",2024]
["UE","(Todas)"]
["Red","LA CONVENCION"]
["MicroRed","(Todas)"]
["EESS","(Todas)"]
["Provincia","(Todas)"]
["Distrito","(Todas)"]
[]
["Etiquetas de fila"," B_ABFNs_CT_1a"," B_ABFNs_CT_2a"," B_ABFNs_CT_3_5a"," B_ABFNs_CT_6_11a"," B_ABFNs_CT_6_11a_g"," B_ABFNs_CT_6_11m"," B_ABFNs_CT_Adol_g"," B_ABFNs_CT_Adolesc"," B_ABFNs_CT_Adulto"," B_ABFNs_CT_Adulto_g"," B_ABFNs_CT_AdultoM"," B_ABFNs_CT_Joven"," B_ABFNs_CT_Joven_g"," B_AFGNs_CT_6_11a_g"," B_AFGNs_CT_Adol_g"," B_AFGNs_CT_Adulto"," B_AFGNs_CT_Adulto_g"," B_AFGNs_CT_AdultoM"," B_AFGNs_CT_Joven_g"," B_ANCEDNs_CT_0_28d"," B_ANCEDNs_CT_1a"," B_ANCEDNs_CT_29_5m"," B_ANCEDNs_CT_2a"," B_ANCEDNs_CT_3_5a"," B_ANCEDNs_CT_6_11a"," B_ANCEDNs_CT_6_11a_g"," B_ANCEDNs_CT_6_11m"," B_ANCEDNs_CT_Adol_g"," B_ANCEDNs_CT_Adolesc"," B_ANCEDNs_CT_Adulto"," B_ANCEDNs_CT_Adulto_g"," B_ANCEDNs_CT_AdultoM"," B_ANCEDNs_CT_Joven"," B_ANCEDNs_CT_Joven_g"," B_ASELNs_CT_2a"," B_ASELNs_CT_3_5a"," B_ASELNs_CT_6_11a"," B_ASELNs_CT_6_11a_g"," B_ASELNs_CT_Adol_g"," B_ASELNs_CT_Adolesc"," B_ASELNs_CT_Adulto"," B_ASELNs_CT_Adulto_g"," B_ASELNs_CT_AdultoM"," B_ASELNs_CT_Joven"," B_ASELNs_CT_Joven_g"," B_Consulta_EstomatoNs_0_28d"," B_Consulta_EstomatoNs_1a"," B_Consulta_EstomatoNs_29_5m"," B_Consulta_EstomatoNs_2a"," B_Consulta_EstomatoNs_3_5a"," B_Consulta_EstomatoNs_6_11a"," B_Consulta_EstomatoNs_6_11a_g"," B_Consulta_EstomatoNs_6_11m"," B_Consulta_EstomatoNs_Adol_g"," B_Consulta_EstomatoNs_Adolesc"," B_Consulta_EstomatoNs_Adulto"," B_Consulta_EstomatoNs_Adulto_g"," B_Consulta_EstomatoNs_AdultoM"," B_Consulta_EstomatoNs_Joven"," B_Consulta_EstomatoNs_Joven_g"," B_Debridacion_BucodenNs_0_28d"," B_Debridacion_BucodenNs_1a"," B_Debridacion_BucodenNs_29_5m"," B_Debridacion_BucodenNs_2a"," B_Debridacion_BucodenNs_3_5a"," B_Debridacion_BucodenNs_6_11a"," B_Debridacion_BucodenNs_6_11a_g"," B_Debridacion_BucodenNs_6_11m"," B_Debridacion_BucodenNs_Adol_g"," B_Debridacion_BucodenNs_Adolesc"," B_Debridacion_BucodenNs_Adulto"," B_Debridacion_BucodenNs_Adulto_g"," B_Debridacion_BucodenNs_AdultoM"," B_Debridacion_BucodenNs_Joven"," B_Debridacion_BucodenNs_Joven_g"," B_DestartrajeNs_CT_0_28d"," B_DestartrajeNs_CT_1a"," B_DestartrajeNs_CT_29_5m"," B_DestartrajeNs_CT_2a"," B_DestartrajeNs_CT_3_5a"," B_DestartrajeNs_CT_6_11a"," B_DestartrajeNs_CT_6_11a_g"," B_DestartrajeNs_CT_6_11m"," B_DestartrajeNs_CT_Adol_g"," B_DestartrajeNs_CT_Adolesc"," B_DestartrajeNs_CT_Adulto"," B_DestartrajeNs_CT_Adulto_g"," B_DestartrajeNs_CT_AdultoM"," B_DestartrajeNs_CT_Joven"," B_DestartrajeNs_CT_Joven_g"," B_Exodoncia_SimpleNs_I_0_28d"," B_Exodoncia_SimpleNs_I_1a"," B_Exodoncia_SimpleNs_I_29_5m"," B_Exodoncia_SimpleNs_I_2a"," B_Exodoncia_SimpleNs_I_3_5a"," B_Exodoncia_SimpleNs_I_6_11a"," B_Exodoncia_SimpleNs_I_6_11a_g"," B_Exodoncia_SimpleNs_I_6_11m"," B_Exodoncia_SimpleNs_I_Adol_g"," B_Exodoncia_SimpleNs_I_Adolesc"," B_Exodoncia_SimpleNs_I_Adulto"," B_Exodoncia_SimpleNs_I_Adulto_g"," B_Exodoncia_SimpleNs_I_AdultoM"," B_Exodoncia_SimpleNs_I_Joven"," B_Exodoncia_SimpleNs_I_Joven_g"," B_EXODONNs_CT_0_28d"," B_EXODONNs_CT_1a"," B_EXODONNs_CT_29_5m"," B_EXODONNs_CT_2a"," B_EXODONNs_CT_3_5a"," B_EXODONNs_CT_6_11a"," B_EXODONNs_CT_6_11a_g"," B_EXODONNs_CT_6_11m"," B_EXODONNs_CT_Adol_g"," B_EXODONNs_CT_Adolesc"," B_EXODONNs_CT_Adulto"," B_EXODONNs_CT_Adulto_g"," B_EXODONNs_CT_AdultoM"," B_EXODONNs_CT_Joven"," B_EXODONNs_CT_Joven_g"," B_IHONs_CT_1a"," B_IHONs_CT_2a"," B_IHONs_CT_3_5a"," B_IHONs_CT_6_11a"," B_IHONs_CT_6_11a_g"," B_IHONs_CT_6_11m"," B_IHONs_CT_Adol_g"," B_IHONs_CT_Adolesc"," B_IHONs_CT_Adulto"," B_IHONs_CT_Adulto_g"," B_IHONs_CT_AdultoM"," B_IHONs_CT_Joven"," B_IHONs_CT_Joven_g"," B_Ionomero_VidrioNs_I_1a"," B_Ionomero_VidrioNs_I_2a"," B_Ionomero_VidrioNs_I_3_5a"," B_Ionomero_VidrioNs_I_6_11a"," B_Ionomero_VidrioNs_I_6_11a_g"," B_Ionomero_VidrioNs_I_6_11m"," B_Ionomero_VidrioNs_I_Adol_g"," B_Ionomero_VidrioNs_I_Adolesc"," B_Ionomero_VidrioNs_I_Adulto"," B_Ionomero_VidrioNs_I_Adulto_g"," B_Ionomero_VidrioNs_I_AdultoM"," B_Ionomero_VidrioNs_I_Joven"," B_Ionomero_VidrioNs_I_Joven_g"," B_MaxiloFacialNs_3_5a"," B_MaxiloFacialNs_6_11a"," B_MaxiloFacialNs_6_11a_g"," B_MaxiloFacialNs_Adol_g"," B_MaxiloFacialNs_Adolesc"," B_MaxiloFacialNs_Adulto"," B_MaxiloFacialNs_Adulto_g"," B_MaxiloFacialNs_AdultoM"," B_MaxiloFacialNs_I_0_28d"," B_MaxiloFacialNs_I_1a"," B_MaxiloFacialNs_I_29_5m"," B_MaxiloFacialNs_I_2a"," B_MaxiloFacialNs_I_6_11m"," B_MaxiloFacialNs_Joven"," B_MaxiloFacialNs_Joven_g"," B_OrtopediaMaxilarNs_in_1a"," B_OrtopediaMaxilarNs_in_2a"," B_OrtopediaMaxilarNs_in_3_5a"," B_OrtopediaMaxilarNs_in_6_11a"," B_OrtopediaMaxilarNs_in_6_11a_g"," B_OrtopediaMaxilarNs_in_6_11m"," B_OrtopediaMaxilarNs_in_Adol_g"," B_OrtopediaMaxilarNs_in_Adolesc"," B_OrtopediaMaxilarNs_in_Adulto"," B_OrtopediaMaxilarNs_in_Adulto_g"," B_OrtopediaMaxilarNs_in_AdultoM"," B_OrtopediaMaxilarNs_in_Joven"," B_OrtopediaMaxilarNs_in_Joven_g"," B_PDNs_CT_1a"," B_PDNs_CT_2a"," B_PDNs_CT_3_5a"," B_PDNs_CT_6_11a"," B_PDNs_CT_6_11a_g"," B_PDNs_CT_6_11m"," B_PDNs_CT_Adol_g"," B_PDNs_CT_Adolesc"," B_PDNs_CT_Adulto"," B_PDNs_CT_Adulto_g"," B_PDNs_CT_AdultoM"," B_PDNs_CT_Joven"," B_PDNs_CT_Joven_g"," B_PulpotomiaNs_I_1a"," B_PulpotomiaNs_I_2a"," B_PulpotomiaNs_I_3_5a"," B_PulpotomiaNs_I_6_11a"," B_PulpotomiaNs_I_6_11a_g"," B_PulpotomiaNs_I_6_11m"," B_PulpotomiaNs_I_Adol_g"," B_PulpotomiaNs_I_Adolesc"," B_PulpotomiaNs_I_Adulto"," B_PulpotomiaNs_I_Adulto_g"," B_PulpotomiaNs_I_AdultoM"," B_PulpotomiaNs_I_Joven"," B_PulpotomiaNs_I_Joven_g"," B_RehabProtesicaNs_in_3_5a"," B_RehabProtesicaNs_in_6_11a"," B_RehabProtesicaNs_in_6_11a_g"," B_RehabProtesicaNs_in_Adol_g"," B_RehabProtesicaNs_in_Adolesc"," B_RehabProtesicaNs_in_Adulto"," B_RehabProtesicaNs_in_Adulto_g"," B_RehabProtesicaNs_in_AdultoM"," B_RehabProtesicaNs_in_Joven"," B_RehabProtesicaNs_in_Joven_g"," B_ResinaNs_I_1a"," B_ResinaNs_I_2a"," B_ResinaNs_I_3_5a"," B_ResinaNs_I_6_11a"," B_ResinaNs_I_6_11a_g"," B_ResinaNs_I_6_11m"," B_ResinaNs_I_Adol_g"," B_ResinaNs_I_Adolesc"," B_ResinaNs_I_Adulto"," B_ResinaNs_I_Adulto_g"," B_ResinaNs_I_AdultoM"," B_ResinaNs_I_Joven"," B_ResinaNs_I_Joven_g"," B_TEndodonticaNs_TA_1a"," B_TEndodonticaNs_TA_2a"," B_TEndodonticaNs_TA_3_5a"," B_TEndodonticaNs_TA_6_11a"," B_TEndodonticaNs_TA_6_11a_g"," B_TEndodonticaNs_TA_6_11m"," B_TEndodonticaNs_TA_Adol_g"," B_TEndodonticaNs_TA_Adolesc"," B_TEndodonticaNs_TA_Adulto"," B_TEndodonticaNs_TA_Adulto_g"," B_TEndodonticaNs_TA_AdultoM"," B_TEndodonticaNs_TA_Joven"," B_TEndodonticaNs_TA_Joven_g"," B_TtoPeriodontalNs_3_5a"," B_TtoPeriodontalNs_6_11a"," B_TtoPeriodontalNs_6_11a_g"," B_TtoPeriodontalNs_Adol_g"," B_TtoPeriodontalNs_Adolesc"," B_TtoPeriodontalNs_Adulto"," B_TtoPeriodontalNs_Adulto_g"," B_TtoPeriodontalNs_AdultoM"," B_TtoPeriodontalNs_Joven"," B_TtoPeriodontalNs_Joven_g"]
[1,0,0,0,0,0,0,0,0,0,0,0,0,0,0,0,0,0,0,0,0,0,0,0,0,0,0,0,0,0,0,0,0,0,0,0,0,0,0,0,0,0,0,0,0,0,0,0,0,0,0,0,0,0,0,0,0,0,0,0,0,0,0,0,0,0,0,0,0,0,0,0,0,0,0,0,0,0,0,0,0,0,0,0,0,0,0,0,0,0,0,0,0,0,0,0,0,0,0,0,0,0,0,0,0,0,0,0,0,0,0,0,0,0,0,0,0,0,0,0,0,0,0,0,0,0,0,0,0,0,0,0,0,0,0,0,0,0,0,0,0,0,0,0,0,0,0,0,0,0,0,0,0,0,0,0,0,0,0,0,0,0,0,0,0,0,0,0,0,0,0,0,0,0,0,0,0,0,0,0,0,0,0,0,0,0,0,0,0,0,0,0,0,0,0,0,0,0,0,0,0,0,0,0,0,0,0,0,0,0,0,0,0,0,0,0,0,0,0,0,0,0,0,0,0,0,0,0,0,0,0,0,0,0,0,0,0,0,0,0,0,0,0,0,0,0,0]
[2,0,0,0,0,0,0,0,0,0,0,0,0,0,0,0,0,0,0,0,0,0,0,0,0,0,0,0,0,0,0,0,0,0,0,0,0,0,0,0,0,0,0,0,0,0,0,0,0,0,0,0,0,0,0,0,0,0,0,0,0,0,0,0,0,0,0,0,0,0,0,0,0,0,0,0,0,0,0,0,0,0,0,0,0,0,0,0,0,0,0,0,0,0,0,0,0,0,0,0,0,0,0,0,0,0,0,0,0,0,0,0,0,0,0,0,0,0,0,0,0,0,0,0,0,0,0,0,0,0,0,0,0,0,0,0,0,0,0,0,0,0,0,0,0,0,0,0,0,0,0,0,0,0,0,0,0,0,0,0,0,0,0,0,0,0,0,0,0,0,0,0,0,0,0,0,0,0,0,0,0,0,0,0,0,0,0,0,0,0,0,0,0,0,0,0,0,0,0,0,0,0,0,0,0,0,0,0,0,0,0,0,0,0,0,0,0,0,0,0,0,0,0,0,0,0,0,0,0,0,0,0,0,0,0,0,0,0,0,0,0,0,0,0,0,0,0]
[3,0,0,0,0,0,0,0,0,0,0,0,0,0,0,0,0,0,0,0,0,0,0,0,0,0,0,0,0,0,0,0,0,0,0,0,0,0,0,0,0,0,0,0,0,0,0,0,0,0,0,0,0,0,0,0,0,0,0,0,0,0,0,0,0,0,0,0,0,0,0,0,0,0,0,0,0,0,0,0,0,0,0,0,0,0,0,0,0,0,0,0,0,0,0,0,0,0,0,0,0,0,0,0,0,0,0,0,0,0,0,0,0,0,0,0,0,0,0,0,0,0,0,0,0,0,0,0,0,0,0,0,0,0,0,0,0,0,0,0,0,0,0,0,0,0,0,0,0,0,0,0,0,0,0,0,0,0,0,0,0,0,0,0,0,0,0,0,0,0,0,0,0,0,0,0,0,0,0,0,0,0,0,0,0,0,0,0,0,0,0,0,0,0,0,0,0,0,0,0,0,0,0,0,0,0,0,0,0,0,0,0,0,0,0,0,0,0,0,0,0,0,0,0,0,0,0,0,0,0,0,0,0,0,0,0,0,0,0,0,0,0,0,0,0,0,0]
[4,0,0,0,0,0,0,0,0,0,0,0,0,0,0,0,0,0,0,0,0,0,0,0,0,0,0,0,0,0,0,0,0,0,0,0,0,0,0,0,0,0,0,0,0,0,0,0,0,0,0,0,0,0,0,0,0,0,0,0,0,0,0,0,0,0,0,0,0,0,0,0,0,0,0,0,0,0,0,0,0,0,0,0,0,0,0,0,0,0,0,0,0,0,0,0,0,0,0,0,0,0,0,0,0,0,0,0,0,0,0,0,0,0,0,0,0,0,0,0,0,0,0,0,0,0,0,0,0,0,0,0,0,0,0,0,0,0,0,0,0,0,0,0,0,0,0,0,0,0,0,0,0,0,0,0,0,0,0,0,0,0,0,0,0,0,0,0,0,0,0,0,0,0,0,0,0,0,0,0,0,0,0,0,0,0,0,0,0,0,0,0,0,0,0,0,0,0,0,0,0,0,0,0,0,0,0,0,0,0,0,0,0,0,0,0,0,0,0,0,0,0,0,0,0,0,0,0,0,0,0,0,0,0,0,0,0,0,0,0,0,0,0,0,0,0,0]
[5,0,0,0,0,0,0,0,0,0,0,0,0,0,0,0,0,0,0,0,0,0,0,0,0,0,0,0,0,0,0,0,0,0,0,0,0,0,0,0,0,0,0,0,0,0,0,0,0,0,0,0,0,0,0,0,0,0,0,0,0,0,0,0,0,0,0,0,0,0,0,0,0,0,0,0,0,0,0,0,0,0,0,0,0,0,0,0,0,0,0,0,0,0,0,0,0,0,0,0,0,0,0,0,0,0,0,0,0,0,0,0,0,0,0,0,0,0,0,0,0,0,0,0,0,0,0,0,0,0,0,0,0,0,0,0,0,0,0,0,0,0,0,0,0,0,0,0,0,0,0,0,0,0,0,0,0,0,0,0,0,0,0,0,0,0,0,0,0,0,0,0,0,0,0,0,0,0,0,0,0,0,0,0,0,0,0,0,0,0,0,0,0,0,0,0,0,0,0,0,0,0,0,0,0,0,0,0,0,0,0,0,0,0,0,0,0,0,0,0,0,0,0,0,0,0,0,0,0,0,0,0,0,0,0,0,0,0,0,0,0,0,0,0,0,0,0]
[6,0,0,0,0,0,0,0,0,0,0,0,0,0,0,0,0,0,0,0,0,0,0,0,0,0,0,0,0,0,0,0,0,0,0,0,0,0,0,0,0,0,0,0,0,0,0,0,0,0,0,0,0,0,0,0,0,0,0,0,0,0,0,0,0,0,0,0,0,0,0,0,0,0,0,0,0,0,0,0,0,0,0,0,0,0,0,0,0,0,0,0,0,0,0,0,0,0,0,0,0,0,0,0,0,0,0,0,0,0,0,0,0,0,0,0,0,0,0,0,0,0,0,0,0,0,0,0,0,0,0,0,0,0,0,0,0,0,0,0,0,0,0,0,0,0,0,0,0,0,0,0,0,0,0,0,0,0,0,0,0,0,0,0,0,0,0,0,0,0,0,0,0,0,0,0,0,0,0,0,0,0,0,0,0,0,0,0,0,0,0,0,0,0,0,0,0,0,0,0,0,0,0,0,0,0,0,0,0,0,0,0,0,0,0,0,0,0,0,0,0,0,0,0,0,0,0,0,0,0,0,0,0,0,0,0,0,0,0,0,0,0,0,0,0,0,0]
[7,0,0,0,0,0,0,0,0,0,0,0,0,0,0,0,0,0,0,0,0,0,0,0,0,0,0,0,0,0,0,0,0,0,0,0,0,0,0,0,0,0,0,0,0,0,0,0,0,0,0,0,0,0,0,0,0,0,0,0,0,0,0,0,0,0,0,0,0,0,0,0,0,0,0,0,0,0,0,0,0,0,0,0,0,0,0,0,0,0,0,0,0,0,0,0,0,0,0,0,0,0,0,0,0,0,0,0,0,0,0,0,0,0,0,0,0,0,0,0,0,0,0,0,0,0,0,0,0,0,0,0,0,0,0,0,0,0,0,0,0,0,0,0,0,0,0,0,0,0,0,0,0,0,0,0,0,0,0,0,0,0,0,0,0,0,0,0,0,0,0,0,0,0,0,0,0,0,0,0,0,0,0,0,0,0,0,0,0,0,0,0,0,0,0,0,0,0,0,0,0,0,0,0,0,0,0,0,0,0,0,0,0,0,0,0,0,0,0,0,0,0,0,0,0,0,0,0,0,0,0,0,0,0,0,0,0,0,0,0,0,0,0,0,0,0,0]
[8,0,0,0,0,0,0,0,0,0,0,0,0,0,0,0,0,0,0,0,0,0,0,0,0,0,0,0,0,0,0,0,0,0,0,0,0,0,0,0,0,0,0,0,0,0,0,0,0,0,0,0,0,0,0,0,0,0,0,0,0,0,0,0,0,0,0,0,0,0,0,0,0,0,0,0,0,0,0,0,0,0,0,0,0,0,0,0,0,0,0,0,0,0,0,0,0,0,0,0,0,0,0,0,0,0,0,0,0,0,0,0,0,0,0,0,0,0,0,0,0,0,0,0,0,0,0,0,0,0,0,0,0,0,0,0,0,0,0,0,0,0,0,0,0,0,0,0,0,0,0,0,0,0,0,0,0,0,0,0,0,0,0,0,0,0,0,0,0,0,0,0,0,0,0,0,0,0,0,0,0,0,0,0,0,0,0,0,0,0,0,0,0,0,0,0,0,0,0,0,0,0,0,0,0,0,0,0,0,0,0,0,0,0,0,0,0,0,0,0,0,0,0,0,0,0,0,0,0,0,0,0,0,0,0,0,0,0,0,0,0,0,0,0,0,0,0]
[9,0,0,0,0,0,0,0,0,0,0,0,0,0,0,0,0,0,0,0,0,0,0,0,0,0,0,0,0,0,0,0,0,0,0,0,0,0,0,0,0,0,0,0,0,0,0,0,0,0,0,0,0,0,0,0,0,0,0,0,0,0,0,0,0,0,0,0,0,0,0,0,0,0,0,0,0,0,0,0,0,0,0,0,0,0,0,0,0,0,0,0,0,0,0,0,0,0,0,0,0,0,0,0,0,0,0,0,0,0,0,0,0,0,0,0,0,0,0,0,0,0,0,0,0,0,0,0,0,0,0,0,0,0,0,0,0,0,0,0,0,0,0,0,0,0,0,0,0,0,0,0,0,0,0,0,0,0,0,0,0,0,0,0,0,0,0,0,0,0,0,0,0,0,0,0,0,0,0,0,0,0,0,0,0,0,0,0,0,0,0,0,0,0,0,0,0,0,0,0,0,0,0,0,0,0,0,0,0,0,0,0,0,0,0,0,0,0,0,0,0,0,0,0,0,0,0,0,0,0,0,0,0,0,0,0,0,0,0,0,0,0,0,0,0,0,0]
[10,0,0,0,0,0,0,0,0,0,0,0,0,0,0,0,0,0,0,0,0,0,0,0,0,0,0,0,0,0,0,0,0,0,0,0,0,0,0,0,0,0,0,0,0,0,0,0,0,0,0,0,0,0,0,0,0,0,0,0,0,0,0,0,0,0,0,0,0,0,0,0,0,0,0,0,0,0,0,0,0,0,0,0,0,0,0,0,0,0,0,0,0,0,0,0,0,0,0,0,0,0,0,0,0,0,0,0,0,0,0,0,0,0,0,0,0,0,0,0,0,0,0,0,0,0,0,0,0,0,0,0,0,0,0,0,0,0,0,0,0,0,0,0,0,0,0,0,0,0,0,0,0,0,0,0,0,0,0,0,0,0,0,0,0,0,0,0,0,0,0,0,0,0,0,0,0,0,0,0,0,0,0,0,0,0,0,0,0,0,0,0,0,0,0,0,0,0,0,0,0,0,0,0,0,0,0,0,0,0,0,0,0,0,0,0,0,0,0,0,0,0,0,0,0,0,0,0,0,0,0,0,0,0,0,0,0,0,0,0,0,0,0,0,0,0,0]
[11,0,0,0,0,0,0,0,0,0,0,0,0,0,0,0,0,0,0,0,0,0,0,0,0,0,0,0,0,0,0,0,0,0,0,0,0,0,0,0,0,0,0,0,0,0,0,0,0,0,0,0,0,0,0,0,0,0,0,0,0,0,0,0,0,0,0,0,0,0,0,0,0,0,0,0,0,0,0,0,0,0,0,0,0,0,0,0,0,0,0,0,0,0,0,0,0,0,0,0,0,0,0,0,0,0,0,0,0,0,0,0,0,0,0,0,0,0,0,0,0,0,0,0,0,0,0,0,0,0,0,0,0,0,0,0,0,0,0,0,0,0,0,0,0,0,0,0,0,0,0,0,0,0,0,0,0,0,0,0,0,0,0,0,0,0,0,0,0,0,0,0,0,0,0,0,0,0,0,0,0,0,0,0,0,0,0,0,0,0,0,0,0,0,0,0,0,0,0,0,0,0,0,0,0,0,0,0,0,0,0,0,0,0,0,0,0,0,0,0,0,0,0,0,0,0,0,0,0,0,0,0,0,0,0,0,0,0,0,0,0,0,0,0,0,0,0]
["Total general",0,0,0,0,0,0,0,0,0,0,0,0,0,0,0,0,0,0,0,0,0,0,0,0,0,0,0,0,0,0,0,0,0,0,0,0,0,0,0,0,0,0,0,0,0,0,0,0,0,0,0,0,0,0,0,0,0,0,0,0,0,0,0,0,0,0,0,0,0,0,0,0,0,0,0,0,0,0,0,0,0,0,0,0,0,0,0,0,0,0,0,0,0,0,0,0,0,0,0,0,0,0,0,0,0,0,0,0,0,0,0,0,0,0,0,0,0,0,0,0,0,0,0,0,0,0,0,0,0,0,0,0,0,0,0,0,0,0,0,0,0,0,0,0,0,0,0,0,0,0,0,0,0,0,0,0,0,0,0,0,0,0,0,0,0,0,0,0,0,0,0,0,0,0,0,0,0,0,0,0,0,0,0,0,0,0,0,0,0,0,0,0,0,0,0,0,0,0,0,0,0,0,0,0,0,0,0,0,0,0,0,0,0,0,0,0,0,0,0,0,0,0,0,0,0,0,0,0,0,0,0,0,0,0,0,0,0,0,0,0,0,0,0,0,0,0]

{"sheet":"Menu","index":2,"n_rows":31,"n_cols":9,"rows_kept":31,"cut":false,"hidden":false,"merged":[[1,4,1,16],[3,4,3,16],[2,4,2,16],[30,5,30,7],[30,8,30,9]]}
[]
[null,null,null,null,"GERESA CUSCO"]
[null,null,null,null,"REPORTE HISMINSA 2024"]
[null,null,null,null,"SALUD BUCAL"]
[]
[]
[]
[]
[]
[]
[]
[]
[]
[]
[]
[]
[]
[]
[]
[]
[]
[]
[]
[]
[]
[]
[]
[]
[]
[]
[null,null,null,null,null,"Fecha Actualización DATA",null,null,"30/11/2024"]

{"sheet":"Informe_Poblacion_General","index":3,"n_rows":91,"n_cols":53,"rows_kept":91,"cut":false,"hidden":false,"merged":[[74,4,74,5],[74,6,74,7],[74,8,74,9],[74,10,74,11],[74,12,74,13],[74,14,74,15],[61,4,61,5],[62,4,62,5],[63,4,63,5],[64,4,64,5],[65,4,65,5],[71,26,71,27],[75,4,75,5],[75,6,75,7],[75,8,75,9],[75,10,75,11],[75,12,75,13],[75,14,75,15],[75,16,75,17],[72,19,72,23],[73,19,73,23],[74,19,74,23],[75,19,75,23],[73,4,73,5],[73,6,73,7],[73,8,73,9],[73,10,73,11],[73,12,73,13],[73,14,73,15],[73,16,73,17],[72,6,72,7],[72,8,72,9],[72,10,72,11],[72,12,72,13],[72,14,72,15],[71,16,71,17],[70,4,70,17],[72,16,72,17],[72,26,72,27],[32,4,32,5],[35,4,35,5],[36,4,36,5],[37,4,37,5],[36,33,36,34],[37,33,37,34],[54,33,54,34],[57,4,57,5],[35,6,35,7],[35,8,35,9],[35,10,35,11],[35,12,35,13],[35,14,35,15],[35,16,35,17],[35,18,35,19],[35,23,35,24],[35,25,35,26],[40,7,40,9],[39,7,39,21],[36,8,36,9],[18,31,19,32],[18,33,19,34],[18,35,19,36],[0,0,0,34],[1,0,1,34],[2,0,2,34],[3,0,3,34],[4,0,4,34],[6,4,6,14],[6,18,6,23],[6,25,6,26],[6,27,6,29],[7,29,7,30],[8,4,8,14],[8,18,8,23],[8,25,8,26],[10,4,10,14],[10,18,10,23],[16,1,16,3],[16,7,16,8],[13,4,15,5],[16,4,16,5],[14,23,15,24],[16,23,16,24],[37,8,37,9],[36,10,36,11],[36,12,36,13],[36,14,36,15],[36,16,36,17],[36,18,36,19],[37,10,37,11],[37,12,37,13],[37,14,37,15],[37,16,37,17],[37,18,37,19],[39,22,40,24],[44,4,44,6],[44,7,44,9],[44,10,44,12],[44,13,44,15],[44,16,44,18],[40,10,40,12],[40,13,40,15],[40,16,40,18],[39,4,40,6],[46,4,47,7],[47,8,47,11],[47,12,47,15],[47,16,47,19],[42,7,42,9],[42,10,42,12],[42,13,42,15],[42,16,42,18],[42,19,42,21],[42,4,42,6],[29,20,30,22],[32,16,32,17],[32,18,32,19],[32,23,32,24],[32,25,32,26],[32,27,32,28],[32,33,32,34],[29,31,30,32],[29,33,29,34],[29,23,29,30],[30,23,30,24],[30,25,30,26],[30,27,30,28],[30,29,30,30],[30,34,31,34],[30,33,31,33],[34,18,34,19],[34,23,34,24],[34,25,34,26],[33,6,33,7],[33,12,33,13],[33,14,33,15],[33,16,33,17],[35,29,35,30],[35,33,35,34],[33,33,33,34],[34,33,34,34],[33,23,33,24],[33,25,33,26],[33,27,33,28],[33,18,33,19],[30,8,30,9],[30,10,30,11],[30,14,30,15],[30,16,30,17],[30,18,30,19],[84,4,85,5],[8,27,8,29],[14,22,15,22],[15,7,15,8],[19,6,19,7],[19,12,19,13],[19,14,19,15],[19,16,19,17],[19,18,19,19],[18,4,19,5],[29,4,30,5],[33,4,33,5],[30,6,30,7],[30,12,30,13],[29,6,29,19],[36,6,36,7],[37,6,37,7],[34,4,34,5],[34,16,34,17],[32,6,32,7],[32,8,32,9],[32,10,32,11],[32,12,32,13],[32,14,32,15],[37,27,37,28],[37,29,37,30],[36,23,36,24],[36,25,36,26],[36,27,36,28],[36,29,36,30],[37,23,37,24],[32,29,32,30],[34,29,34,30],[33,29,33,30],[37,25,37,26],[33,8,33,9],[33,10,33,11],[34,27,34,28],[34,6,34,7],[34,8,34,9],[34,10,34,11],[34,12,34,13],[34,14,34,15],[22,29,22,30],[46,47,47,50],[46,51,47,52],[39,37,40,39],[39,40,40,41],[42,25,42,27],[42,28,42,30],[44,31,44,33],[44,34,44,36],[42,37,42,39],[44,37,44,39],[42,31,42,33],[42,34,42,36],[47,31,47,34],[47,35,47,38],[47,39,47,42],[47,43,47,46],[46,31,46,46],[39,25,39,36],[40,25,40,27],[40,28,40,30],[35,27,35,28],[29,35,30,36],[40,31,40,33],[40,34,40,36],[66,24,66,30],[57,17,57,19],[58,17,58,19],[59,17,59,19],[47,20,47,23],[47,24,47,27],[46,8,46,27],[46,28,47,30],[52,25,52,26],[44,19,44,21],[44,25,44,27],[44,28,44,30],[51,31,52,32],[54,25,54,26],[54,27,54,28],[54,29,54,30],[61,19,61,20],[61,21,61,22],[61,23,61,24],[61,25,61,26],[61,27,61,28],[61,29,61,30],[40,19,40,21],[74,1,74,3],[75,1,75,3],[56,20,56,21],[56,22,56,23],[56,24,56,25],[71,4,71,5],[71,6,71,7],[71,8,71,9],[71,10,71,11],[71,12,71,13],[71,14,71,15],[72,1,72,3],[73,1,73,3],[59,1,65,1],[63,17,63,18],[64,17,64,18],[62,17,62,18],[66,17,66,23],[58,4,58,5],[59,4,59,5],[60,4,60,5],[56,4,56,5],[74,16,74,17],[72,4,72,5],[54,4,54,5],[54,6,54,7],[54,8,54,9],[54,10,54,11],[54,12,54,13],[54,14,54,15],[54,16,54,17],[54,18,54,19],[54,23,54,24],[51,4,52,5],[51,6,51,19],[52,6,52,7],[52,8,52,9],[52,10,52,11],[52,12,52,13],[52,27,52,28],[52,29,52,30],[52,18,52,19],[51,20,52,22],[52,23,52,24],[52,14,52,15],[52,16,52,17],[76,19,76,23],[73,26,73,27],[74,26,74,27],[75,26,75,27],[76,26,76,27],[79,11,79,12],[78,11,78,12],[80,11,80,12],[81,11,81,12],[82,11,82,12],[85,8,85,9],[85,10,85,11],[85,22,85,23],[85,24,85,25],[84,20,84,27],[85,20,85,21],[85,26,85,27],[78,7,78,10],[79,7,79,10],[82,7,82,10],[81,7,81,10],[80,7,80,10],[84,6,84,19],[85,16,85,17],[85,14,85,15],[85,18,85,19],[85,12,85,13],[85,6,85,7],[84,28,85,29],[86,8,86,9],[86,10,86,11],[86,14,86,15],[86,16,86,17],[86,18,86,19],[86,20,86,21],[86,22,86,23],[86,24,86,25],[86,26,86,27],[86,28,86,29],[86,12,86,13],[88,22,88,23],[88,24,88,25],[88,26,88,27],[88,28,88,29],[87,8,87,9],[87,10,87,11],[87,14,87,15],[87,16,87,17],[87,18,87,19],[87,20,87,21],[87,22,87,23],[87,24,87,25],[87,26,87,27],[87,28,87,29],[88,16,88,17],[87,12,87,13],[88,12,88,13],[89,22,89,23],[89,24,89,25],[89,26,89,27],[89,28,89,29],[90,8,90,9],[90,10,90,11],[90,14,90,15],[90,20,90,21],[90,22,90,23],[90,24,90,25],[90,26,90,27],[90,28,90,29],[89,16,89,17],[90,16,90,17],[90,18,90,19],[89,12,89,13],[90,12,90,13],[89,8,89,9],[89,10,89,11],[84,1,85,3],[86,1,86,3],[87,1,87,3],[88,1,88,3],[89,1,89,3],[90,1,90,3],[89,14,89,15],[89,18,89,19],[89,20,89,21],[88,8,88,9],[88,10,88,11],[88,14,88,15],[88,18,88,19],[88,20,88,21],[86,4,86,5],[86,6,86,7],[87,6,87,7],[88,6,88,7],[89,6,89,7],[90,6,90,7],[87,4,87,5],[88,4,88,5],[89,4,89,5],[90,4,90,5],[22,33,22,34],[13,6,14,15],[22,4,22,5],[22,6,22,7],[22,8,22,9],[22,10,22,11],[22,12,22,13],[22,14,22,15],[22,16,22,17],[22,18,22,19],[18,20,19,22],[19,8,19,9],[19,10,19,11],[15,14,15,15],[16,14,16,15],[18,6,18,19],[19,23,19,24],[19,25,19,26],[19,27,19,28],[19,29,19,30],[18,23,18,30],[22,23,22,24],[22,25,22,26],[22,27,22,28],[15,9,15,10],[16,9,16,10],[13,22,13,26],[14,25,15,25],[14,26,15,26],[14,16,15,17],[16,16,16,17],[13,16,13,20],[14,18,15,18],[14,19,15,19],[14,20,15,20]]}
["GERENCIA REGIONAL DE SALUD CUSCO"]
["DIRECCION EJECUTIVA DE INTELIGENCIA SANITARIA"]
["DIRECCION DE ESTADISTICA INFORMATICA Y TELECOMUNICACIONES"]
["SALUD BUCAL"]
["INFORME DE AVANCES DE METAS FISICAS TODO TIPO DE SEGURO"]
[]
[null,null,null,"RED DE SALUD",{"$f":"TD!F3","v":"LA CONVENCION"},null,null,null,null,null,null,null,null,null,null,null,"PROVINCIA",null,{"$f":"TD!F6","v":"(All)"},null,null,null,null,null,null,"AÑO :",null,{"$f":"TD!C10","v":"2024"}]
[]
[null,null,null,"MICRO RED",{"$f":"TD!F4","v":"(All)"},null,null,null,null,null,null,null,null,null,null,null,"DISTRITO",null,{"$f":"TD!F7","v":"(All)"},null,null,null,null,null,null,"MES :",null,{"$f":"TD!O17","v":"ENERO - NOVIEMBRE"}]
[]
[null,null,null,"ESTABLECIMIENTO",{"$f":"TD!F5","v":"(All)"},null,null,null,null,null,null,null,null,null,null,null,"U.E.",null,{"$f":"TD!F8","v":"(All)"}]
[]
[]
[null,null,null,null,"Total",null,"Curso de Vida Niño",null,null,null,null,null,null,null,null,null,"Cursos de Vida",null,null,null,null,null,"Gestante"]
[null,null,null,null,null,null,null,null,null,null,null,null,null,null,null,null,"Adolescente",null,"Joven","Adulto","Adulto Mayor",null,"6a - 11a","Adolescente",null,"Joven","Adulta"]
[null,null,null,null,null,null,"0 a 28d","29dias a 5meses",null,"6meses a 11meses",null,"1 año"," 2 años","3 a 5 años","6 a 11 años"]
[1,"Alta Básica Odontológica",null,null,{"$f":"+G17+H17+J17+L17+M17+N17+O17+Q17+S17+T17+U17","v":3190},null,{"$f":"SUM(GETPIVOTDATA(\"Suma de B_ABO_0_28d\",TD!$A$38))","v":6},{"$f":"SUM(GETPIVOTDATA(\"Suma de B_ABO_29_5m\",TD!$A$38))","v":30},null,{"$f":"SUM(GETPIVOTDATA(\"Suma de B_ABO_6_11m\",TD!$A$38))","v":114},null,{"$f":"SUM(GETPIVOTDATA(\"Suma de B_ABO_1a\",TD!$A$38))","v":149},{"$f":"SUM(GETPIVOTDATA(\"Suma de B_ABO_2a\",TD!$A$38))","v":98},{"$f":"SUM(GETPIVOTDATA(\"Suma de B_ABO_3_5a\",TD!$A$38))","v":627},{"$f":"SUM(GETPIVOTDATA(\"Suma de B_ABO_6_11a\",TD!$A$38))","v":1294},null,{"$f":"SUM(GETPIVOTDATA(\"Suma de B_ABO_Adolesc\",TD!$A$38))","v":459},null,{"$f":"SUM(GETPIVOTDATA(\"Suma de B_ABO_Joven\",TD!$A$38))","v":161},{"$f":"SUM(GETPIVOTDATA(\"Suma de B_ABO_Adulto\",TD!$A$38))","v":147},{"$f":"SUM(GETPIVOTDATA(\"Suma de B_ABO_AdultoM\",TD!$A$38))","v":105},null,{"$f":"SUM(GETPIVOTDATA(\"Suma de B_ABO_6_11a_g\",TD!$A$38))","v":0},{"$f":"SUM(GETPIVOTDATA(\"Suma de B_ABO_adolesc_g\",TD!$A$38))","v":20},null,{"$f":"SUM(GETPIVOTDATA(\"Suma de B_ABO_Joven_g\",TD!$A$38))","v":164},{"$f":"SUM(GETPIVOTDATA(\"Suma de B_ABO_Adulto_g\",TD!$A$38))","v":153}]
[]
[null,null,null,null,"Total",null,"Curso de Vida Niño",null,null,null,null,null,null,null,null,null,null,null,null,null,"META NIÑO",null,null,"Cursos de Vida",null,null,null,null,null,null,null,"META ADULTO MAYOR",null,"Gestante",null,"META GESTANTE"]
[null,null,null,null,null,null,"0 a 28d",null,"29d a 5m",null,"6m a 11m",null,"1 año",null," 2 años",null,"3 a 5 años",null,"6 a 11 años",null,null,null,null,"Adolescente",null,"Joven",null,"Adulto",null,"Adulto Mayor"]
[null,"PpR","Freq","Atención Estomatológica Preventiva (3000680)","Inician","Caso Ttdo.","Inician","Caso Ttdo.","Inician","Caso Ttdo.","Inician","Caso Ttdo.","Inician","Caso Ttdo.","Inician","Caso Ttdo.","Inician","Caso Ttdo.","Inician","Caso Ttdo.","Total Caso Ttdo.","Meta","% Avance","Inician","Caso Ttdo.","Inician","Caso Ttdo.","Inician","Caso Ttdo.","Inician","Caso Ttdo.","Meta","% Avance","Inician","Caso Ttdo.","Meta","% Avance"]
[1,"0068001",2,"Asesoría nutricional para el control de enfermedades dentales",{"$f":"+G22+I22+K22+M22+O22+Q22+S22+X22+Z22+AB22+AD22","v":12584},{"$f":"+H22+J22+L22+N22+P22+R22+T22+Y22+AA22+AC22+AE22","v":3591},{"$f":"SUM(GETPIVOTDATA(\"Suma de B_ANCED_I_0_28d\",TD!$A$38))","v":11},{"$f":"SUM(GETPIVOTDATA(\"Suma de B_ANCED_ct_0_28d\",TD!$A$38))","v":0},{"$f":"SUM(GETPIVOTDATA(\"Suma de B_ANCED_I_29_5m\",TD!$A$38))","v":28},{"$f":"SUM(GETPIVOTDATA(\"Suma de B_ANCED_ct_29_5m\",TD!$A$38))","v":10},{"$f":"SUM(GETPIVOTDATA(\"Suma de B_ANCED_I_6_11m\",TD!$A$38))","v":143},{"$f":"SUM(GETPIVOTDATA(\"Suma de B_ANCED_ct_6_11m\",TD!$A$38))","v":23},{"$f":"SUM(GETPIVOTDATA(\"Suma de B_ANCED_I_1a\",TD!$A$38))","v":215},{"$f":"SUM(GETPIVOTDATA(\"Suma de B_ANCED_ct_1a\",TD!$A$38))","v":48},{"$f":"SUM(GETPIVOTDATA(\"Suma de B_ANCED_I_2a\",TD!$A$38))","v":219},{"$f":"SUM(GETPIVOTDATA(\"Suma de B_ANCED_ct_2a\",TD!$A$38))","v":39},{"$f":"SUM(GETPIVOTDATA(\"Suma de B_ANCED_I_3_5a\",TD!$A$38))","v":1566},{"$f":"SUM(GETPIVOTDATA(\"Suma de B_ANCED_ct_3_5a\",TD!$A$38))","v":616},{"$f":"SUM(GETPIVOTDATA(\"Suma de B_ANCED_I_6_11a\",TD!$A$38))","v":3108},{"$f":"SUM(GETPIVOTDATA(\"Suma de B_ANCED_ct_6_11a\",TD!$A$38))","v":1545},{"$f":"+H22+J22+L22+N22+P22+R22+T22","v":2281},null,{"$f":"IFERROR(+U22*100/V22,0)","v":0},{"$f":"SUM(GETPIVOTDATA(\"Suma de B_ANCED_I_Adolesc\",TD!$A$38))","v":2160},{"$f":"SUM(GETPIVOTDATA(\"Suma de B_ANCED_ct_Adolesc\",TD!$A$38))","v":615},{"$f":"SUM(GETPIVOTDATA(\"Suma de B_ANCED_I_JOven\",TD!$A$38))","v":1609},{"$f":"SUM(GETPIVOTDATA(\"Suma de B_ANCED_ct_JOven\",TD!$A$38))","v":260},{"$f":"SUM(GETPIVOTDATA(\"Suma de B_ANCED_I_Adulto\",TD!$A$38))","v":2563},{"$f":"SUM(GETPIVOTDATA(\"Suma de B_ANCED_ct_Adulto\",TD!$A$38))","v":313},{"$f":"SUM(GETPIVOTDATA(\"Suma de B_ANCED_I_AdultoM\",TD!$A$38))","v":962},{"$f":"SUM(GETPIVOTDATA(\"Suma de B_ANCED_ct_AdultoM\",TD!$A$38))","v":122},null,{"$f":"IFERROR(+AE22*100/AF22,0)","v":0},{"$f":"SUM(GETPIVOTDATA(\"Suma de B_ANCED_I_Gest\",TD!$A$38))","v":1195},{"$f":"SUM(GETPIVOTDATA(\"Suma de B_ANCED_ct_Gest\",TD!$A$38))","v":528},null,{"$f":"IFERROR(+AI22*100/AJ22,0)","v":0}]
[2,"0068002",2,"Examen Estomatológico",{"$f":"+G23+I23+K23+M23+O23+Q23+S23+X23+Z23+AB23+AD23","v":12538},null,{"$f":"SUM(GETPIVOTDATA(\"Suma de B_EXODON_CT_0_28d\",TD!$A$38))","v":10},null,{"$f":"SUM(GETPIVOTDATA(\"Suma de B_EXODON_CT_29_5m\",TD!$A$38))","v":29},null,{"$f":"SUM(GETPIVOTDATA(\"Suma de B_EXODON_CT_6_11m\",TD!$A$38))","v":145},null,{"$f":"SUM(GETPIVOTDATA(\"Suma de B_EXODON_CT_1a\",TD!$A$38))","v":218},null,{"$f":"SUM(GETPIVOTDATA(\"Suma de B_EXODON_CT_2a\",TD!$A$38))","v":225},null,{"$f":"SUM(GETPIVOTDATA(\"Suma de B_EXODON_CT_3_5a\",TD!$A$38))","v":1553},null,{"$f":"SUM(GETPIVOTDATA(\"Suma de B_EXODON_CT_6_11a\",TD!$A$38))","v":3049},null,{"$f":"+G23+I23+K23+M23+O23+Q23+S23","v":5229},null,{"$f":"IFERROR(+U23*100/V23,0)","v":0},{"$f":"SUM(GETPIVOTDATA(\"Suma de B_EXODON_CT_Adolesc\",TD!$A$38))","v":2154},null,{"$f":"SUM(GETPIVOTDATA(\"Suma de B_EXODON_CT_Joven\",TD!$A$38))","v":1604},null,{"$f":"SUM(GETPIVOTDATA(\"Suma de B_EXODON_CT_Adulto\",TD!$A$38))","v":2587},null,{"$f":"SUM(GETPIVOTDATA(\"Suma de B_EXODON_CT_AdultoM\",TD!$A$38))","v":964},null,null,0,{"$f":"SUM(GETPIVOTDATA(\"Suma de B_EXODON_CT_Gest\",TD!$A$38))","v":1187},null,null,{"$f":"IFERROR(+AI23*100/AJ23,0)","v":0}]
[3,"0068003",2,"Instrucción de higiene oral",{"$f":"+G24+I24+K24+M24+O24+Q24+S24+X24+Z24+AB24+AD24","v":12641},{"$f":"+H24+J24+L24+N24+P24+R24+T24+Y24+AA24+AC24+AE24","v":3597},{"$f":"SUM(GETPIVOTDATA(\"Suma de B_IHO_i_0_28d\",TD!$A$38))","v":11},{"$f":"SUM(GETPIVOTDATA(\"Suma de B_IHO_ct_0_28d\",TD!$A$38))","v":0},{"$f":"SUM(GETPIVOTDATA(\"Suma de B_IHO_I_29_5m\",TD!$A$38))","v":28},{"$f":"SUM(GETPIVOTDATA(\"Suma de B_IHO_ct_29_5m\",TD!$A$38))","v":10},{"$f":"SUM(GETPIVOTDATA(\"Suma de B_IHO_I_6_11m\",TD!$A$38))","v":145},{"$f":"SUM(GETPIVOTDATA(\"Suma de B_IHO_ct_6_11m\",TD!$A$38))","v":24},{"$f":"SUM(GETPIVOTDATA(\"Suma de B_IHO_I_1a\",TD!$A$38))","v":219},{"$f":"SUM(GETPIVOTDATA(\"Suma de B_IHO_ct_1a\",TD!$A$38))","v":48},{"$f":"SUM(GETPIVOTDATA(\"Suma de B_IHO_I_2a\",TD!$A$38))","v":223},{"$f":"SUM(GETPIVOTDATA(\"Suma de B_IHO_ct_2a\",TD!$A$38))","v":38},{"$f":"SUM(GETPIVOTDATA(\"Suma de B_IHO_I_3_5a\",TD!$A$38))","v":1578},{"$f":"SUM(GETPIVOTDATA(\"Suma de B_IHO_ct_3_5a\",TD!$A$38))","v":618},{"$f":"SUM(GETPIVOTDATA(\"Suma de B_IHO_I_6_11a\",TD!$A$38))","v":3109},{"$f":"SUM(GETPIVOTDATA(\"Suma de B_IHO_ct_6_11a\",TD!$A$38))","v":1553},{"$f":"+H24+J24+L24+N24+P24+R24+T24","v":2291},null,{"$f":"IFERROR(+U24*100/V24,0)","v":0},{"$f":"SUM(GETPIVOTDATA(\"Suma de B_IHO_I_Adolesc\",TD!$A$38))","v":2165},{"$f":"SUM(GETPIVOTDATA(\"Suma de B_IHO_ct_Adolesc\",TD!$A$38))","v":614},{"$f":"SUM(GETPIVOTDATA(\"Suma de B_IHO_I_JOven\",TD!$A$38))","v":1616},{"$f":"SUM(GETPIVOTDATA(\"Suma de B_IHO_ct_JOven\",TD!$A$38))","v":260},{"$f":"SUM(GETPIVOTDATA(\"Suma de B_IHO_I_Adulto\",TD!$A$38))","v":2577},{"$f":"SUM(GETPIVOTDATA(\"Suma de B_IHO_ct_Adulto\",TD!$A$38))","v":311},{"$f":"SUM(GETPIVOTDATA(\"Suma de B_IHO_I_AdultoM\",TD!$A$38))","v":970},{"$f":"SUM(GETPIVOTDATA(\"Suma de B_IHO_ct_AdultoM\",TD!$A$38))","v":121},null,0,{"$f":"SUM(GETPIVOTDATA(\"Suma de B_IHO_I_Gest\",TD!$A$38))","v":1200},{"$f":"SUM(GETPIVOTDATA(\"Suma de B_IHO_ct_Gest\",TD!$A$38))","v":526},null,0]
[4,"5000602",4,"Aplicación de Sellantes",{"$f":"+G25+I25+K25+M25+O25+Q25+S25+X25+Z25+AB25+AD25","v":1562},{"$f":"+H25+J25+L25+N25+P25+R25+T25+Y25+AA25+AC25+AE25","v":468},{"$f":"SUM(GETPIVOTDATA(\"Suma de B_ASEL_i_0_28d\",TD!$A$38))","v":0},{"$f":"SUM(GETPIVOTDATA(\"Suma de B_ASEL_ct_0_28d\",TD!$A$38))","v":0},{"$f":"SUM(GETPIVOTDATA(\"Suma de B_ASEL_I_29_5m\",TD!$A$38))","v":0},{"$f":"SUM(GETPIVOTDATA(\"Suma de B_ASEL_ct_29_5m\",TD!$A$38))","v":0},{"$f":"SUM(GETPIVOTDATA(\"Suma de B_ASEL_I_6_11m\",TD!$A$38))","v":0},{"$f":"SUM(GETPIVOTDATA(\"Suma de B_ASEL_ct_6_11m\",TD!$A$38))","v":0},{"$f":"SUM(GETPIVOTDATA(\"Suma de B_ASEL_I_1a\",TD!$A$38))","v":0},{"$f":"SUM(GETPIVOTDATA(\"Suma de B_ASEL_ct_1a\",TD!$A$38))","v":0},{"$f":"SUM(GETPIVOTDATA(\"Suma de B_ASEL_I_2a\",TD!$A$38))","v":8},{"$f":"SUM(GETPIVOTDATA(\"Suma de B_ASEL_ct_2a\",TD!$A$38))","v":1},{"$f":"SUM(GETPIVOTDATA(\"Suma de B_ASEL_I_3_5a\",TD!$A$38))","v":256},{"$f":"SUM(GETPIVOTDATA(\"Suma de B_ASEL_ct_3_5a\",TD!$A$38))","v":72},{"$f":"SUM(GETPIVOTDATA(\"Suma de B_ASEL_I_6_11a\",TD!$A$38))","v":1182},{"$f":"SUM(GETPIVOTDATA(\"Suma de B_ASEL_ct_6_11a\",TD!$A$38))","v":360},{"$f":"+H25+J25+L25+N25+P25+R25+T25","v":433},null,{"$f":"IFERROR(+U25*100/V25,0)","v":0},{"$f":"SUM(GETPIVOTDATA(\"Suma de B_ASEL_I_Adolesc\",TD!$A$38))","v":98},{"$f":"SUM(GETPIVOTDATA(\"Suma de B_ASEL_ct_Adolesc\",TD!$A$38))","v":28},{"$f":"SUM(GETPIVOTDATA(\"Suma de B_ASEL_I_JOven\",TD!$A$38))","v":15},{"$f":"SUM(GETPIVOTDATA(\"Suma de B_ASEL_ct_JOven\",TD!$A$38))","v":5},{"$f":"SUM(GETPIVOTDATA(\"Suma de B_ASEL_I_Adulto\",TD!$A$38))","v":3},{"$f":"SUM(GETPIVOTDATA(\"Suma de B_ASEL_ct_Adulto\",TD!$A$38))","v":2},{"$f":"SUM(GETPIVOTDATA(\"Suma de B_ASEL_I_AdultoM\",TD!$A$38))","v":0},{"$f":"SUM(GETPIVOTDATA(\"Suma de B_ASEL_ct_AdultoM\",TD!$A$38))","v":0},null,0,{"$f":"SUM(GETPIVOTDATA(\"Suma de B_ASEL_I_Gest\",TD!$A$38))","v":4},{"$f":"SUM(GETPIVOTDATA(\"Suma de B_ASEL_ct_Gest\",TD!$A$38))","v":3},null,0]
[5,"5000603",2,"Aplicación de Barniz Fluorado",{"$f":"+G26+I26+K26+M26+O26+Q26+S26+X26+Z26+AB26+AD26","v":8626},{"$f":"+H26+J26+L26+N26+P26+R26+T26+Y26+AA26+AC26+AE26","v":3445},{"$f":"SUM(GETPIVOTDATA(\"Suma de B_ABF_i_0_28d\",TD!$A$38))","v":0},{"$f":"SUM(GETPIVOTDATA(\"Suma de B_ABF_ct_0_28d\",TD!$A$38))","v":0},{"$f":"SUM(GETPIVOTDATA(\"Suma de B_ABF_I_29_5m\",TD!$A$38))","v":6},{"$f":"SUM(GETPIVOTDATA(\"Suma de B_ABF_ct_29_5m\",TD!$A$38))","v":1},{"$f":"SUM(GETPIVOTDATA(\"Suma de B_ABF_I_6_11m\",TD!$A$38))","v":125},{"$f":"SUM(GETPIVOTDATA(\"Suma de B_ABF_ct_6_11m\",TD!$A$38))","v":20},{"$f":"SUM(GETPIVOTDATA(\"Suma de B_ABF_I_1a\",TD!$A$38))","v":210},{"$f":"SUM(GETPIVOTDATA(\"Suma de B_ABF_ct_1a\",TD!$A$38))","v":46},{"$f":"SUM(GETPIVOTDATA(\"Suma de B_ABF_I_2a\",TD!$A$38))","v":216},{"$f":"SUM(GETPIVOTDATA(\"Suma de B_ABF_ct_2a\",TD!$A$38))","v":52},{"$f":"SUM(GETPIVOTDATA(\"Suma de B_ABF_I_3_5a\",TD!$A$38))","v":1599},{"$f":"SUM(GETPIVOTDATA(\"Suma de B_ABF_ct_3_5a\",TD!$A$38))","v":696},{"$f":"SUM(GETPIVOTDATA(\"Suma de B_ABF_I_6_11a\",TD!$A$38))","v":3095},{"$f":"SUM(GETPIVOTDATA(\"Suma de B_ABF_ct_6_11a\",TD!$A$38))","v":1658},{"$f":"+H26+J26+L26+N26+P26+R26+T26","v":2473},null,{"$f":"IFERROR(+U26*100/V26,0)","v":0},{"$f":"SUM(GETPIVOTDATA(\"Suma de B_ABF_I_Adolesc\",TD!$A$38))","v":1811},{"$f":"SUM(GETPIVOTDATA(\"Suma de B_ABF_ct_Adolesc\",TD!$A$38))","v":610},{"$f":"SUM(GETPIVOTDATA(\"Suma de B_ABF_I_JOven\",TD!$A$38))","v":1046},{"$f":"SUM(GETPIVOTDATA(\"Suma de B_ABF_ct_JOven\",TD!$A$38))","v":268},{"$f":"SUM(GETPIVOTDATA(\"Suma de B_ABF_I_Adulto\",TD!$A$38))","v":393},{"$f":"SUM(GETPIVOTDATA(\"Suma de B_ABF_ct_Adulto\",TD!$A$38))","v":79},{"$f":"SUM(GETPIVOTDATA(\"Suma de B_ABF_I_AdultoM\",TD!$A$38))","v":125},{"$f":"SUM(GETPIVOTDATA(\"Suma de B_ABF_ct_AdultoM\",TD!$A$38))","v":15},null,0,{"$f":"SUM(GETPIVOTDATA(\"Suma de B_ABF_I_Gest\",TD!$A$38))","v":1053},{"$f":"SUM(GETPIVOTDATA(\"Suma de B_ABF_ct_Gest\",TD!$A$38))","v":536},null,0]
[6,"5000603",2,"Aplicación de Flúor Gel",{"$f":"+G27+I27+K27+M27+O27+Q27+S27+X27+Z27+AB27+AD27","v":3141},{"$f":"+H27+J27+L27+N27+P27+R27+T27+Y27+AA27+AC27+AE27","v":654},{"$f":"SUM(GETPIVOTDATA(\"Suma de B_AFG_i_0_28d\",TD!$A$38))","v":0},{"$f":"SUM(GETPIVOTDATA(\"Suma de B_AFG_ct_0_28d\",TD!$A$38))","v":0},{"$f":"SUM(GETPIVOTDATA(\"Suma de B_AFG_I_29_5m\",TD!$A$38))","v":0},{"$f":"SUM(GETPIVOTDATA(\"Suma de B_AFG_ct_29_5m\",TD!$A$38))","v":0},{"$f":"SUM(GETPIVOTDATA(\"Suma de B_AFG_I_6_11m\",TD!$A$38))","v":4},{"$f":"SUM(GETPIVOTDATA(\"Suma de B_AFG_ct_6_11m\",TD!$A$38))","v":0},{"$f":"SUM(GETPIVOTDATA(\"Suma de B_AFG_I_1a\",TD!$A$38))","v":3},{"$f":"SUM(GETPIVOTDATA(\"Suma de B_AFG_ct_1a\",TD!$A$38))","v":2},{"$f":"SUM(GETPIVOTDATA(\"Suma de B_AFG_I_2a\",TD!$A$38))","v":4},{"$f":"SUM(GETPIVOTDATA(\"Suma de B_AFG_ct_2a\",TD!$A$38))","v":0},{"$f":"SUM(GETPIVOTDATA(\"Suma de B_AFG_I_3_5a\",TD!$A$38))","v":30},{"$f":"SUM(GETPIVOTDATA(\"Suma de B_AFG_ct_3_5a\",TD!$A$38))","v":9},{"$f":"SUM(GETPIVOTDATA(\"Suma de B_AFG_I_6_11a\",TD!$A$38))","v":72},{"$f":"SUM(GETPIVOTDATA(\"Suma de B_AFG_ct_6_11a\",TD!$A$38))","v":38},{"$f":"+H27+J27+L27+N27+P27+R27+T27","v":49},null,{"$f":"IFERROR(+U27*100/V27,0)","v":0},{"$f":"SUM(GETPIVOTDATA(\"Suma de B_AFG_I_Adolesc\",TD!$A$38))","v":227},{"$f":"SUM(GETPIVOTDATA(\"Suma de B_AFG_ct_Adolesc\",TD!$A$38))","v":67},{"$f":"SUM(GETPIVOTDATA(\"Suma de B_AFG_I_JOven\",TD!$A$38))","v":378},{"$f":"SUM(GETPIVOTDATA(\"Suma de B_AFG_ct_JOven\",TD!$A$38))","v":84},{"$f":"SUM(GETPIVOTDATA(\"Suma de B_AFG_I_Adulto\",TD!$A$38))","v":1754},{"$f":"SUM(GETPIVOTDATA(\"Suma de B_AFG_ct_Adulto\",TD!$A$38))","v":333},{"$f":"SUM(GETPIVOTDATA(\"Suma de B_AFG_I_AdultoM\",TD!$A$38))","v":669},{"$f":"SUM(GETPIVOTDATA(\"Suma de B_AFG_ct_AdultoM\",TD!$A$38))","v":121},null,0,{"$f":"SUM(GETPIVOTDATA(\"Suma de B_AFG_I_Gest\",TD!$A$38))","v":125},{"$f":"SUM(GETPIVOTDATA(\"Suma de B_AFG_ct_Gest\",TD!$A$38))","v":57},null,0]
[7,"5000606",2,"Profilaxis Dental",{"$f":"+G28+I28+K28+M28+O28+Q28+S28+X28+Z28+AB28+AD28","v":11797},{"$f":"+H28+J28+L28+N28+P28+R28+T28+Y28+AA28+AC28+AE28","v":4027},{"$f":"SUM(GETPIVOTDATA(\"Suma de B_PD_i_0_28d\",TD!$A$38))","v":0},{"$f":"SUM(GETPIVOTDATA(\"Suma de B_PD_ct_0_28d\",TD!$A$38))","v":0},{"$f":"SUM(GETPIVOTDATA(\"Suma de B_PD_I_29_5m\",TD!$A$38))","v":3},{"$f":"SUM(GETPIVOTDATA(\"Suma de B_PD_ct_29_5m\",TD!$A$38))","v":1},{"$f":"SUM(GETPIVOTDATA(\"Suma de B_PD_I_6_11m\",TD!$A$38))","v":55},{"$f":"SUM(GETPIVOTDATA(\"Suma de B_PD_ct_6_11m\",TD!$A$38))","v":14},{"$f":"SUM(GETPIVOTDATA(\"Suma de B_PD_I_1a\",TD!$A$38))","v":121},{"$f":"SUM(GETPIVOTDATA(\"Suma de B_PD_ct_1a\",TD!$A$38))","v":32},{"$f":"SUM(GETPIVOTDATA(\"Suma de B_PD_I_2a\",TD!$A$38))","v":181},{"$f":"SUM(GETPIVOTDATA(\"Suma de B_PD_ct_2a\",TD!$A$38))","v":51},{"$f":"SUM(GETPIVOTDATA(\"Suma de B_PD_I_3_5a\",TD!$A$38))","v":1538},{"$f":"SUM(GETPIVOTDATA(\"Suma de B_PD_ct_3_5a\",TD!$A$38))","v":694},{"$f":"SUM(GETPIVOTDATA(\"Suma de B_PD_I_6_11a\",TD!$A$38))","v":3081},{"$f":"SUM(GETPIVOTDATA(\"Suma de B_PD_ct_6_11a\",TD!$A$38))","v":1689},{"$f":"+H28+J28+L28+N28+P28+R28+T28","v":2481},null,{"$f":"IFERROR(+U28*100/V28,0)","v":0},{"$f":"SUM(GETPIVOTDATA(\"Suma de B_PD_I_Adolesc\",TD!$A$38))","v":2065},{"$f":"SUM(GETPIVOTDATA(\"Suma de B_PD_ct_Adolesc\",TD!$A$38))","v":667},{"$f":"SUM(GETPIVOTDATA(\"Suma de B_PD_I_JOven\",TD!$A$38))","v":1530},{"$f":"SUM(GETPIVOTDATA(\"Suma de B_PD_ct_JOven\",TD!$A$38))","v":346},{"$f":"SUM(GETPIVOTDATA(\"Suma de B_PD_I_Adulto\",TD!$A$38))","v":2383},{"$f":"SUM(GETPIVOTDATA(\"Suma de B_PD_ct_Adulto\",TD!$A$38))","v":387},{"$f":"SUM(GETPIVOTDATA(\"Suma de B_PD_I_AdultoM\",TD!$A$38))","v":840},{"$f":"SUM(GETPIVOTDATA(\"Suma de B_PD_ct_AdultoM\",TD!$A$38))","v":146},null,0,{"$f":"SUM(GETPIVOTDATA(\"Suma de B_PD_I_Gest\",TD!$A$38))","v":1161},{"$f":"SUM(GETPIVOTDATA(\"Suma de B_PD_ct_Gest\",TD!$A$38))","v":568},null,0]
[]
[null,null,null,null,"Total",null,"Curso de Vida Niño",null,null,null,null,null,null,null,null,null,null,null,null,null,"META NIÑO",null,null,"Cursos de Vida",null,null,null,null,null,null,null,"META ADULTO MAYOR",null,"Gestante",null,"META GESTANTE"]
[null,null,null,null,null,null,"0 a 28d",null,"29d a 5m",null,"6m a 11m",null,"1 año",null," 2 años",null,"3 a 5 años",null,"6 a 11 años",null,null,null,null,"Adolescente",null,"Joven",null,"Adulto",null,"Adulto Mayor",null,null,null,"Inician","Caso Ttdo."]
[null,"PpR","Freq","Atención Estomatológica Recuperativa  (3000681)","Inician","Caso Ttdo.","Inician","Caso Ttdo.","Inician","Caso Ttdo.","Inician","Caso Ttdo.","Inician","Caso Ttdo.","Inician","Caso Ttdo.","Inician","Caso Ttdo.","Inician","Caso Ttdo.","Total Caso Ttdo.","Meta","% Avance","Inician","Caso Ttdo.","Inician","Caso Ttdo.","Inician","Caso Ttdo.","Inician","Caso Ttdo.","Meta","% Avance",null,null,"Meta","% Avance"]
[8,"0068101",2,"Raspaje Dental (Destartraje)",{"$f":"+G33+I33+K33+M33+O33+Q33+S33+X33+Z33+AB33+AD33","v":1762},null,{"$f":"SUM(GETPIVOTDATA(\"Suma de B_Destartraje_CT_0_28d\",TD!$A$62))","v":0},null,{"$f":"SUM(GETPIVOTDATA(\"Suma de B_Destartraje_CT_29_5m\",TD!$A$62))","v":0},null,{"$f":"SUM(GETPIVOTDATA(\"Suma de B_Destartraje_CT_6_11m\",TD!$A$62))","v":0},null,{"$f":"SUM(GETPIVOTDATA(\"Suma de B_Destartraje_CT_1a\",TD!$A$62))","v":1},null,{"$f":"SUM(GETPIVOTDATA(\"Suma de B_Destartraje_CT_2a\",TD!$A$62))","v":1},null,{"$f":"SUM(GETPIVOTDATA(\"Suma de B_Destartraje_CT_3_5a\",TD!$A$62))","v":17},null,{"$f":"SUM(GETPIVOTDATA(\"Suma de B_Destartraje_CT_6_11a\",TD!$A$62))","v":31},null,{"$f":"+G33+I33+K33+M33+O33+Q33+S33","v":50},null,{"$f":"IFERROR(+U33*100/V33,0)","v":0},{"$f":"SUM(GETPIVOTDATA(\"Suma de B_Destartraje_CT_Adolesc\",TD!$A$62))","v":277},null,{"$f":"SUM(GETPIVOTDATA(\"Suma de B_Destartraje_CT_Joven\",TD!$A$62))","v":405},null,{"$f":"SUM(GETPIVOTDATA(\"Suma de B_Destartraje_CT_Adulto\",TD!$A$62))","v":750},null,{"$f":"SUM(GETPIVOTDATA(\"Suma de B_Destartraje_CT_Adultom\",TD!$A$62))","v":280},null,null,{"$f":"IFERROR(+AE33*100/AF33,0)","v":0},{"$f":"SUM(GETPIVOTDATA(\"Suma de B_Destartraje_CT_Gest\",TD!$A$62))","v":607},null,null,{"$f":"IFERROR(+AI33*100/AJ33,0)","v":0}]
[9,"  ",1,"Debridación de los Procesos Infecciosos Bucodentales",384,null,{"$f":"SUM(GETPIVOTDATA(\"Suma de B_Debridacion_Bucoden_0_28d\",TD!$A$62))","v":0},null,{"$f":"SUM(GETPIVOTDATA(\"Suma de B_Debridacion_Bucoden_29_5m\",TD!$A$62))","v":0},null,{"$f":"SUM(GETPIVOTDATA(\"Suma de B_Debridacion_Bucoden_6_11m\",TD!$A$62))","v":0},null,{"$f":"SUM(GETPIVOTDATA(\"Suma de B_Debridacion_Bucoden_1a\",TD!$A$62))","v":0},null,{"$f":"SUM(GETPIVOTDATA(\"Suma de B_Debridacion_Bucoden_2a\",TD!$A$62))","v":2},null,{"$f":"SUM(GETPIVOTDATA(\"Suma de B_Debridacion_Bucoden_3_5a\",TD!$A$62))","v":49},null,{"$f":"SUM(GETPIVOTDATA(\"Suma de B_Debridacion_Bucoden_6_11a\",TD!$A$62))","v":59},null,110,null,{"$f":"IFERROR(+U34*100/V34,0)","v":0},{"$f":"SUM(GETPIVOTDATA(\"Suma de B_Debridacion_Bucoden_Adolesc\",TD!$A$62))","v":59},null,{"$f":"SUM(GETPIVOTDATA(\"Suma de B_Debridacion_Bucoden_Joven\",TD!$A$62))","v":82},null,{"$f":"SUM(GETPIVOTDATA(\"Suma de B_Debridacion_Bucoden_Adulto\",TD!$A$62))","v":111},null,{"$f":"SUM(GETPIVOTDATA(\"Suma de B_Debridacion_Bucoden_Adultom\",TD!$A$62))","v":22},null,null,{"$f":"IFERROR(+AE34*100/AF34,0)","v":0},{"$f":"SUM(GETPIVOTDATA(\"Suma de B_Debridacion_Bucoden_Gest\",TD!$A$62))","v":5},null,null,{"$f":"IFERROR(+AI34*100/AJ34,0)","v":0}]
[10,"5000702",1,"Consulta Estomatológica",3705,null,{"$f":"SUM(GETPIVOTDATA(\"Suma de B_Consulta_Estomato_0_28d\",TD!$A$62))","v":8},null,{"$f":"SUM(GETPIVOTDATA(\"Suma de B_Consulta_Estomato_29_5m\",TD!$A$62))","v":0},null,{"$f":"SUM(GETPIVOTDATA(\"Suma de B_Consulta_Estomato_6_11m\",TD!$A$62))","v":1},null,{"$f":"SUM(GETPIVOTDATA(\"Suma de B_Consulta_Estomato_1a\",TD!$A$62))","v":13},null,{"$f":"SUM(GETPIVOTDATA(\"Suma de B_Consulta_Estomato_2a\",TD!$A$62))","v":21},null,{"$f":"SUM(GETPIVOTDATA(\"Suma de B_Consulta_Estomato_3_5a\",TD!$A$62))","v":336},null,{"$f":"SUM(GETPIVOTDATA(\"Suma de B_Consulta_Estomato_6_11a\",TD!$A$62))","v":572},null,951,null,0,{"$f":"SUM(GETPIVOTDATA(\"Suma de B_Consulta_Estomato_Adolesc\",TD!$A$62))","v":435},null,{"$f":"SUM(GETPIVOTDATA(\"Suma de B_Consulta_Estomato_Joven\",TD!$A$62))","v":712},null,{"$f":"SUM(GETPIVOTDATA(\"Suma de B_Consulta_Estomato_Adulto\",TD!$A$62))","v":1155},null,{"$f":"SUM(GETPIVOTDATA(\"Suma de B_Consulta_Estomato_Adultom\",TD!$A$62))","v":452},null,null,0,{"$f":"SUM(GETPIVOTDATA(\"Suma de B_Consulta_Estomato_Gest\",TD!$A$62))","v":118},null,null,{"$f":"IFERROR(+AI35*100/AJ35,0)","v":0}]
[11,"5000703",2,"Exodoncia Simple",3842,null,{"$f":"SUM(GETPIVOTDATA(\"Suma de B_Exodoncia_Simple_I_0_28d\",TD!$A$62))","v":0},null,{"$f":"SUM(GETPIVOTDATA(\"Suma de B_Exodoncia_Simple_I_29_5m\",TD!$A$62))","v":0},null,{"$f":"SUM(GETPIVOTDATA(\"Suma de B_Exodoncia_Simple_I_6_11m\",TD!$A$62))","v":0},null,{"$f":"SUM(GETPIVOTDATA(\"Suma de B_Exodoncia_Simple_I_1a\",TD!$A$62))","v":0},null,{"$f":"SUM(GETPIVOTDATA(\"Suma de B_Exodoncia_Simple_I_2a\",TD!$A$62))","v":1},null,{"$f":"SUM(GETPIVOTDATA(\"Suma de B_Exodoncia_Simple_I_3_5a\",TD!$A$62))","v":112},null,{"$f":"SUM(GETPIVOTDATA(\"Suma de B_Exodoncia_Simple_I_6_11a\",TD!$A$62))","v":869},null,982,null,0,{"$f":"SUM(GETPIVOTDATA(\"Suma de B_Exodoncia_Simple_I_Adolesc\",TD!$A$62))","v":392},null,{"$f":"SUM(GETPIVOTDATA(\"Suma de B_Exodoncia_Simple_I_Joven\",TD!$A$62))","v":598},null,{"$f":"SUM(GETPIVOTDATA(\"Suma de B_Exodoncia_Simple_I_Adulto\",TD!$A$62))","v":1203},null,{"$f":"SUM(GETPIVOTDATA(\"Suma de B_Exodoncia_Simple_I_Adultom\",TD!$A$62))","v":667},null,null,0,{"$f":"SUM(GETPIVOTDATA(\"Suma de B_Exodoncia_Simple_I_Gest\",TD!$A$62))","v":100},null,null,{"$f":"IFERROR(+AI36*100/AJ36,0)","v":0}]
[12,"5000704",3,"Restauraciones Dentales con Ionómero de Vidrio",2554,null,{"$f":"SUM(GETPIVOTDATA(\"Suma de B_Ionomero_Vidrio_I_0_28d\",TD!$A$62))","v":0},null,{"$f":"SUM(GETPIVOTDATA(\"Suma de B_Ionomero_Vidrio_I_29_5m\",TD!$A$62))","v":0},null,{"$f":"SUM(GETPIVOTDATA(\"Suma de B_Ionomero_Vidrio_I_6_11m\",TD!$A$62))","v":1},null,{"$f":"SUM(GETPIVOTDATA(\"Suma de B_Ionomero_Vidrio_I_1a\",TD!$A$62))","v":2},null,{"$f":"SUM(GETPIVOTDATA(\"Suma de B_Ionomero_Vidrio_I_2a\",TD!$A$62))","v":35},null,{"$f":"SUM(GETPIVOTDATA(\"Suma de B_Ionomero_Vidrio_I_3_5a\",TD!$A$62))","v":1057},null,{"$f":"SUM(GETPIVOTDATA(\"Suma de B_Ionomero_Vidrio_I_6_11a\",TD!$A$62))","v":726},null,1821,null,0,{"$f":"SUM(GETPIVOTDATA(\"Suma de B_Ionomero_Vidrio_I_Adolesc\",TD!$A$62))","v":317},null,{"$f":"SUM(GETPIVOTDATA(\"Suma de B_Ionomero_Vidrio_I_Joven\",TD!$A$62))","v":159},null,{"$f":"SUM(GETPIVOTDATA(\"Suma de B_Ionomero_Vidrio_I_Adulto\",TD!$A$62))","v":207},null,{"$f":"SUM(GETPIVOTDATA(\"Suma de B_Ionomero_Vidrio_I_Adultom\",TD!$A$62))","v":50},null,null,0,{"$f":"SUM(GETPIVOTDATA(\"Suma de B_Ionomero_Vidrio_I_Gest\",TD!$A$62))","v":93},null,null,{"$f":"IFERROR(+AI37*100/AJ37,0)","v":0}]
[13,"5000705",4,"Restauraciones Dentales con Resina",11902,null,{"$f":"SUM(GETPIVOTDATA(\"Suma de B_Resina_I_0_28d\",TD!$A$62))","v":0},null,{"$f":"SUM(GETPIVOTDATA(\"Suma de B_Resina_I_29_5m\",TD!$A$62))","v":0},null,{"$f":"SUM(GETPIVOTDATA(\"Suma de B_Resina_I_6_11m\",TD!$A$62))","v":6},null,{"$f":"SUM(GETPIVOTDATA(\"Suma de B_Resina_I_1a\",TD!$A$62))","v":10},null,{"$f":"SUM(GETPIVOTDATA(\"Suma de B_Resina_I_2a\",TD!$A$62))","v":59},null,{"$f":"SUM(GETPIVOTDATA(\"Suma de B_Resina_I_3_5a\",TD!$A$62))","v":1234},null,{"$f":"SUM(GETPIVOTDATA(\"Suma de B_Resina_I_6_11a\",TD!$A$62))","v":2270},null,3579,null,{"$f":"IFERROR(+U38*100/V38,0)","v":0},{"$f":"SUM(GETPIVOTDATA(\"Suma de B_Resina_I_Adolesc\",TD!$A$62))","v":2466},null,{"$f":"SUM(GETPIVOTDATA(\"Suma de B_Resina_I_Joven\",TD!$A$62))","v":2448},null,{"$f":"SUM(GETPIVOTDATA(\"Suma de B_Resina_I_Adulto\",TD!$A$62))","v":2838},null,{"$f":"SUM(GETPIVOTDATA(\"Suma de B_Resina_I_Adultom\",TD!$A$62))","v":571},null,null,{"$f":"IFERROR(+AE38*100/AF38,0)","v":0},{"$f":"SUM(GETPIVOTDATA(\"Suma de B_Resina_I_Gest\",TD!$A$62))","v":1660},null,null,{"$f":"IFERROR(+AI38*100/AJ38,0)","v":0}]
[]
[null,null,null,null,"Total",null,null,"Curso de Vida Niño",null,null,null,null,null,null,null,null,null,null,null,null,null,null,"META NIÑO",null,null,"Cursos de Vida",null,null,null,null,null,null,null,null,null,null,null,"Gestante",null,null,"META GESTANTE"]
[null,null,null,null,null,null,null,"6m a 11m",null,null,"1 año",null,null,"2 años",null,null,"3 a 5 años",null,null,"6 a 11 años",null,null,null,null,null,"Adolescente",null,null,"Joven",null,null,"Adulto",null,null,"Adulto Mayor"]
[null,"PpR","Freq","Atención Estomatológica Especializada (3000682)","Inicio","Caso Continuado.","Caso Ttdo.","Inicio","Caso Continuado.","Caso Ttdo.","Inicio","Caso Continuado.","Caso Ttdo.","Inicio","Caso Continuado.","Caso Ttdo.","Inicio","Caso Continuado.","Caso Ttdo.","Inicio","Caso Continuado.","Caso Ttdo.","Total Caso Ttdo.","Meta","% Avance","Inicio","Caso Continuado.","Caso Ttdo.","Inicio","Caso Continuado.","Caso Ttdo.","Inicio","Caso Continuado.","Caso Ttdo.","Inicio","Caso Continuado.","Caso Ttdo.","Inicio","Caso Continuado","Caso Ttdo.","Meta","% Avance"]
[14,"5000814",2,"Terapia Pulpar",{"$f":"+H43+K43+N43+Q43+T43+Z43+AC43+AF43+AI43","v":748},null,null,{"$f":"SUM(GETPIVOTDATA(\"Suma de B_Pulpotomia_I_6_11m\",TD!$A$62))","v":0},null,null,{"$f":"SUM(GETPIVOTDATA(\"Suma de B_Pulpotomia_I_1a\",TD!$A$62))","v":0},null,null,{"$f":"SUM(GETPIVOTDATA(\"Suma de B_Pulpotomia_I_2a\",TD!$A$62))","v":2},null,null,{"$f":"SUM(GETPIVOTDATA(\"Suma de B_Pulpotomia_I_3_5a\",TD!$A$62))","v":51},null,null,{"$f":"SUM(GETPIVOTDATA(\"Suma de B_Pulpotomia_I_6_11a\",TD!$A$62))","v":128},null,null,{"$f":"+H43+K43+N43+Q43+T43","v":181},null,{"$f":"IFERROR(+W43*100/X43,0)","v":0},{"$f":"SUM(GETPIVOTDATA(\"Suma de B_Pulpotomia_I_Adolesc\",TD!$A$62))","v":190},null,null,{"$f":"SUM(GETPIVOTDATA(\"Suma de B_Pulpotomia_I_Joven\",TD!$A$62))","v":148},null,null,{"$f":"SUM(GETPIVOTDATA(\"Suma de B_Pulpotomia_I_Adulto\",TD!$A$62))","v":183},null,null,{"$f":"SUM(GETPIVOTDATA(\"Suma de B_Pulpotomia_I_AdultoM\",TD!$A$62))","v":46},null,null,{"$f":"SUM(GETPIVOTDATA(\"Suma de B_Pulpotomia_I_Gest\",TD!$A$62))","v":62},null,null,null,{"$f":"IFERROR(+AN43*100/AO43,0)","v":0}]
[15,"5000815",2,"Terapia Endodóntica",{"$f":"+H44+K44+N44+Q44+T44+Z44+AC44+AF44+AI44","v":54},{"$f":"+I44+L44+O44+R44+U44+AA44+AD44+AG44+AJ44","v":35},{"$f":"+J44+M44+P44+S44+V44+AB44+AE44+AH44+AK44","v":86},{"$f":"SUM(GETPIVOTDATA(\"Suma de B_TEndodontica_IA_6_11m\",TD!$A$62))","v":0},{"$f":"SUM(GETPIVOTDATA(\"Suma de B_TEndodontica_CA_6_11m\",TD!$A$62))","v":0},{"$f":"SUM(GETPIVOTDATA(\"Suma de B_TEndodontica_tA_6_11m\",TD!$A$62))","v":0},{"$f":"SUM(GETPIVOTDATA(\"Suma de B_TEndodontica_IA_1a\",TD!$A$62))","v":0},{"$f":"SUM(GETPIVOTDATA(\"Suma de B_TEndodontica_CA_1a\",TD!$A$62))","v":0},{"$f":"SUM(GETPIVOTDATA(\"Suma de B_TEndodontica_TA_1a\",TD!$A$62))","v":0},{"$f":"SUM(GETPIVOTDATA(\"Suma de B_TEndodontica_IA_2a\",TD!$A$62))","v":0},{"$f":"SUM(GETPIVOTDATA(\"Suma de B_TEndodontica_CA_2a\",TD!$A$62))","v":0},{"$f":"SUM(GETPIVOTDATA(\"Suma de B_TEndodontica_TA_2a\",TD!$A$62))","v":2},{"$f":"SUM(GETPIVOTDATA(\"Suma de B_TEndodontica_IA_3_5a\",TD!$A$62))","v":17},{"$f":"SUM(GETPIVOTDATA(\"Suma de B_TEndodontica_CA_3_5a\",TD!$A$62))","v":6},{"$f":"SUM(GETPIVOTDATA(\"Suma de B_TEndodontica_TA_3_5a\",TD!$A$62))","v":56},{"$f":"SUM(GETPIVOTDATA(\"Suma de B_TEndodontica_IA_6_11a\",TD!$A$62))","v":4},{"$f":"SUM(GETPIVOTDATA(\"Suma de B_TEndodontica_CA_6_11a\",TD!$A$62))","v":3},{"$f":"SUM(GETPIVOTDATA(\"Suma de B_TEndodontica_TA_6_11a\",TD!$A$62))","v":10},{"$f":"+J44+M44+P44+S44+V44","v":68},null,{"$f":"IFERROR(+W44*100/X44,0)","v":0},{"$f":"SUM(GETPIVOTDATA(\"Suma de B_TEndodontica_IA_Adolesc\",TD!$A$62))","v":10},{"$f":"SUM(GETPIVOTDATA(\"Suma de B_TEndodontica_CA_Adolesc\",TD!$A$62))","v":10},{"$f":"SUM(GETPIVOTDATA(\"Suma de B_TEndodontica_TA_Adolesc\",TD!$A$62))","v":10},{"$f":"SUM(GETPIVOTDATA(\"Suma de B_TEndodontica_IA_JOven\",TD!$A$62))","v":14},{"$f":"SUM(GETPIVOTDATA(\"Suma de B_TEndodontica_CA_JOven\",TD!$A$62))","v":11},{"$f":"SUM(GETPIVOTDATA(\"Suma de B_TEndodontica_TA_JOven\",TD!$A$62))","v":7},{"$f":"SUM(GETPIVOTDATA(\"Suma de B_TEndodontica_IA_Adulto\",TD!$A$62))","v":9},{"$f":"SUM(GETPIVOTDATA(\"Suma de B_TEndodontica_CA_Adulto\",TD!$A$62))","v":4},{"$f":"SUM(GETPIVOTDATA(\"Suma de B_TEndodontica_TA_Adulto\",TD!$A$62))","v":1},{"$f":"SUM(GETPIVOTDATA(\"Suma de B_TEndodontica_IA_AdultoM\",TD!$A$62))","v":0},{"$f":"SUM(GETPIVOTDATA(\"Suma de B_TEndodontica_CA_AdultoM\",TD!$A$62))","v":1},{"$f":"SUM(GETPIVOTDATA(\"Suma de B_TEndodontica_TA_AdultoM\",TD!$A$62))","v":0},{"$f":"SUM(GETPIVOTDATA(\"Suma de B_TEndodontica_IA_G\",TD!$A$62))","v":1},{"$f":"SUM(GETPIVOTDATA(\"Suma de B_TEndodontica_CA_g\",TD!$A$62))","v":0},{"$f":"SUM(GETPIVOTDATA(\"Suma de B_TEndodontica_TA_g\",TD!$A$62))","v":1},null,{"$f":"IFERROR(+AN44*100/AO44,0)","v":0}]
[16,"5000816",2,"Tratamiento Periodontal",{"$f":"+Q45+T45+Z45+AC45+AF45+AI45","v":10},null,null,null,null,null,null,null,null,null,null,null,{"$f":"SUM(GETPIVOTDATA(\"Suma de B_TtoPeriodontal_3_5a\",TD!$A$86))","v":2},null,null,{"$f":"SUM(GETPIVOTDATA(\"Suma de B_TtoPeriodontal_6_11a\",TD!$A$82))","v":3},null,null,{"$f":"Q45+T45","v":5},null,0,{"$f":"SUM(GETPIVOTDATA(\"Suma de B_TtoPeriodontal_Adolesc\",TD!$A$82))","v":1},null,null,{"$f":"SUM(GETPIVOTDATA(\"Suma de B_TtoPeriodontal_Joven\",TD!$A$82))","v":0},null,null,{"$f":"SUM(GETPIVOTDATA(\"Suma de B_TtoPeriodontal_Adulto\",TD!$A$82))","v":4},null,null,{"$f":"SUM(GETPIVOTDATA(\"Suma de B_TtoPeriodontal_AdultoM\",TD!$A$82))","v":0},null,null,{"$f":"SUM(GETPIVOTDATA(\"Suma de B_TtoPeriodontal_G\",TD!$A$82))","v":7},null,null,null,{"$f":"IFERROR(+AN45*100/AO45,0)","v":0}]
[]
[null,null,null,null,"Total",null,null,null,"Curso de Vida Niño",null,null,null,null,null,null,null,null,null,null,null,null,null,null,null,null,null,null,null,"META NIÑO",null,null,"Cursos de Vida",null,null,null,null,null,null,null,null,null,null,null,null,null,null,null,"Gestante",null,null,null,"META GESTANTE"]
[null,null,null,null,null,null,null,null,"6m a 11m",null,null,null,"1 año",null,null,null,"2 años",null,null,null,"3 a 5 años",null,null,null,"6 a 11 años",null,null,null,null,null,null,"Adolescente",null,null,null,"Joven",null,null,null,"Adulto",null,null,null,"Adulto Mayor"]
[17,"PpR","Freq","Atención Estomatológica Especializada (3000682)","Inicio","Caso Ttdo","Continua Tto","Termina Tto","Inicio","Caso Ttdo.","Continua Tto","Termina Tto","Inicio","Caso Ttdo.","Continua Tto","Termina Tto","Inicio","Caso Ttdo.","Continua Tto","Termina Tto","Inicio","Caso Ttdo.","Continua Tto","Termina Tto","Inicio","Caso Ttdo.","Continua Tto","Termina Tto","Total Caso Ttdo.","Meta","% Avance","Inicio","Caso Ttdo.","Continua Tto","TerminaTto","Inicio","Caso Ttdo.","Continua Tto","TerminaTto","Inicio","Caso Ttdo.","Continua Tto","TerminaTto","Inicio","Caso Ttdo.","Continua Tto","TerminaTto","Inicio","Caso Ttdo","Continua Tto","Termina Tto","Meta","% Avance"]
[18,"500818",null,"Tto de Ortodoncia y Ortopedia Maxilar",null,null,null,null,{"$f":"SUM(GETPIVOTDATA(\"Suma de B_OrtopediaMaxilar_ia_6_11m\",TD!$A$62))","v":0},{"$f":"SUM(GETPIVOTDATA(\"Suma de B_OrtopediaMaxilar_in_6_11m\",TD!$A$62))","v":0},{"$f":"SUM(GETPIVOTDATA(\"Suma de B_OrtopediaMaxilar_ca_6_11m\",TD!$A$62))","v":0},{"$f":"SUM(GETPIVOTDATA(\"Suma de B_OrtopediaMaxilar_ta_6_11m\",TD!$A$62))","v":0},{"$f":"SUM(GETPIVOTDATA(\"Suma de B_OrtopediaMaxilar_ia_1a\",TD!$A$62))","v":0},{"$f":"SUM(GETPIVOTDATA(\"Suma de B_OrtopediaMaxilar_in_1a\",TD!$A$62))","v":0},{"$f":"SUM(GETPIVOTDATA(\"Suma de B_OrtopediaMaxilar_ca_1a\",TD!$A$62))","v":0},{"$f":"SUM(GETPIVOTDATA(\"Suma de B_OrtopediaMaxilar_ta_1a\",TD!$A$62))","v":0},{"$f":"SUM(GETPIVOTDATA(\"Suma de B_OrtopediaMaxilar_ia_2a\",TD!$A$62))","v":0},{"$f":"SUM(GETPIVOTDATA(\"Suma de B_OrtopediaMaxilar_in_2a\",TD!$A$62))","v":0},{"$f":"SUM(GETPIVOTDATA(\"Suma de B_OrtopediaMaxilar_ca_2a\",TD!$A$62))","v":0},{"$f":"SUM(GETPIVOTDATA(\"Suma de B_OrtopediaMaxilar_ta_2a\",TD!$A$62))","v":0},{"$f":"SUM(GETPIVOTDATA(\"Suma de B_OrtopediaMaxilar_ia_3_5a\",TD!$A$62))","v":0},{"$f":"SUM(GETPIVOTDATA(\"Suma de B_OrtopediaMaxilar_in_3_5a\",TD!$A$62))","v":0},{"$f":"SUM(GETPIVOTDATA(\"Suma de B_OrtopediaMaxilar_ca_3_5a\",TD!$A$62))","v":0},{"$f":"SUM(GETPIVOTDATA(\"Suma de B_OrtopediaMaxilar_ta_3_5a\",TD!$A$62))","v":0},{"$f":"SUM(GETPIVOTDATA(\"Suma de B_OrtopediaMaxilar_ia_6_11a\",TD!$A$62))","v":0},{"$f":"SUM(GETPIVOTDATA(\"Suma de B_OrtopediaMaxilar_in_6_11a\",TD!$A$62))","v":0},{"$f":"SUM(GETPIVOTDATA(\"Suma de B_OrtopediaMaxilar_ca_6_11a\",TD!$A$62))","v":0},{"$f":"SUM(GETPIVOTDATA(\"Suma de B_OrtopediaMaxilar_ta_6_11a\",TD!$A$62))","v":0},{"$f":"+J50+N50+R50+V50+Z50","v":0},null,{"$f":"IFERROR(+AC50*100/AD50,0)","v":0},{"$f":"SUM(GETPIVOTDATA(\"Suma de B_OrtopediaMaxilar_ia_Adolesc\",TD!$A$62))","v":0},{"$f":"SUM(GETPIVOTDATA(\"Suma de B_OrtopediaMaxilar_in_Adolesc\",TD!$A$62))","v":0},{"$f":"SUM(GETPIVOTDATA(\"Suma de B_OrtopediaMaxilar_ca_Adolesc\",TD!$A$62))","v":0},{"$f":"SUM(GETPIVOTDATA(\"Suma de B_OrtopediaMaxilar_ta_Adolesc\",TD!$A$62))","v":0},{"$f":"SUM(GETPIVOTDATA(\"Suma de B_OrtopediaMaxilar_ia_Joven\",TD!$A$62))","v":0},{"$f":"SUM(GETPIVOTDATA(\"Suma de B_OrtopediaMaxilar_in_Joven\",TD!$A$62))","v":0},{"$f":"SUM(GETPIVOTDATA(\"Suma de B_OrtopediaMaxilar_ca_Joven\",TD!$A$62))","v":0},{"$f":"SUM(GETPIVOTDATA(\"Suma de B_OrtopediaMaxilar_ta_Joven\",TD!$A$62))","v":0},{"$f":"SUM(GETPIVOTDATA(\"Suma de B_OrtopediaMaxilar_ia_Adulto\",TD!$A$62))","v":0},{"$f":"SUM(GETPIVOTDATA(\"Suma de B_OrtopediaMaxilar_in_Adulto\",TD!$A$62))","v":0},{"$f":"SUM(GETPIVOTDATA(\"Suma de B_OrtopediaMaxilar_ca_Adulto\",TD!$A$62))","v":0},{"$f":"SUM(GETPIVOTDATA(\"Suma de B_OrtopediaMaxilar_ta_Adulto\",TD!$A$62))","v":0},{"$f":"SUM(GETPIVOTDATA(\"Suma de B_OrtopediaMaxilar_ia_AdultoM\",TD!$A$62))","v":0},{"$f":"SUM(GETPIVOTDATA(\"Suma de B_OrtopediaMaxilar_in_Adultom\",TD!$A$62))","v":0},{"$f":"SUM(GETPIVOTDATA(\"Suma de B_OrtopediaMaxilar_ca_Adultom\",TD!$A$62))","v":0},{"$f":"SUM(GETPIVOTDATA(\"Suma de B_OrtopediaMaxilar_ta_Adultom\",TD!$A$62))","v":0},{"$f":"SUM(GETPIVOTDATA(\"Suma de B_OrtopediaMaxilar_ia_g\",TD!$A$62))","v":0},{"$f":"SUM(GETPIVOTDATA(\"Suma de B_OrtopediaMaxilar_in_g\",TD!$A$62))","v":0},{"$f":"SUM(GETPIVOTDATA(\"Suma de B_OrtopediaMaxilar_ca_g\",TD!$A$62))","v":0},{"$f":"SUM(GETPIVOTDATA(\"Suma de B_OrtopediaMaxilar_ta_g\",TD!$A$62))","v":0},null,{"$f":"IFERROR(+AW50*100/AZ50,0)","v":0}]
[]
[null,null,null,null,"Total",null,"Curso de Vida Niño",null,null,null,null,null,null,null,null,null,null,null,null,null,"META NIÑO",null,null,null,"Cursos de Vida",null,null,null,null,null,null,"META ADULTO MAYOR",null,"Gestante",null,"META GESTANTE"]
[null,null,null,null,null,null,"0 a 28d",null,"29d a 5m",null,"6m a 11m",null,"1 año",null," 2 años",null,"3 a 5 años",null,"6 a 11 años",null,null,null,null,"Adolescente",null,"Joven",null,"Adulto",null,"Adulto Mayor"]
[null,"PpR","Freq","Atención Estomatológica Especializada (3000682)","Inicio","Caso Ttdo","Inicio","Caso Ttdo.","Inicio","Caso Ttdo.","Inicio","Caso Ttdo.","Inicio","Caso Ttdo.","Inicio","Caso Ttdo.","Inicio","Caso Ttdo.","Inicio","Caso Ttdo.","Total Caso Ttdo.","Meta","% Avance","Inicio","Caso Ttdo.","Inicio","Caso Ttdo.","Inicio","Caso Ttdo.","Inicio","Caso Ttdo.","Meta","% Avance","Inicio","Caso Ttdo","Meta","% Avance"]
[null,"500817",null,"Tto Quirurgico Bucal y Máxilo Facial",{"$f":"SUM(H55,Q55,T55,W55,Z55)","v":21},null,{"$f":"SUM(GETPIVOTDATA(\"Suma de B_MaxiloFacial_I_0_28d\",TD!$A$86))","v":0},null,{"$f":"SUM(GETPIVOTDATA(\"Suma de B_MaxiloFacial_I_29_5m\",TD!$A$86))","v":0},null,{"$f":"SUM(GETPIVOTDATA(\"Suma de B_MaxiloFacial_I_6_11m\",TD!$A$86))","v":0},null,{"$f":"SUM(GETPIVOTDATA(\"Suma de B_MaxiloFacial_I_1a\",TD!$A$86))","v":0},null,{"$f":"SUM(GETPIVOTDATA(\"Suma de B_MaxiloFacial_I_2a\",TD!$A$86))","v":0},null,{"$f":"SUM(GETPIVOTDATA(\"Suma de B_MaxiloFacial_3_5a\",TD!$A$86))","v":0},null,{"$f":"SUM(GETPIVOTDATA(\"Suma de B_MaxiloFacial_6_11a\",TD!$A$86))","v":2},null,{"$f":"+G55+I55+K55+M55+O55+Q55+S55","v":2},null,{"$f":"IFERROR(+U55*100/V55,0)","v":0},{"$f":"SUM(GETPIVOTDATA(\"Suma de B_MaxiloFacial_Adolesc\",TD!$A$86))","v":2},null,{"$f":"SUM(GETPIVOTDATA(\"Suma de B_MaxiloFacial_Joven\",TD!$A$86))","v":21},null,{"$f":"SUM(GETPIVOTDATA(\"Suma de B_MaxiloFacial_Adulto\",TD!$A$86))","v":12},null,{"$f":"SUM(GETPIVOTDATA(\"Suma de B_MaxiloFacial_AdultoM\",TD!$A$86))","v":8},null,null,{"$f":"IFERROR(+AE55*100/AF55,0)","v":0},{"$f":"SUM(GETPIVOTDATA(\"Suma de B_MaxiloFacial_g\",TD!$A$86))","v":0},null,null,{"$f":"IFERROR(+AH55*100/AJ55,0)","v":0}]
[]
[31,null,null,null,"Cursos de Vida",null,null,null,null,null,null,null,null,null,null,null,null,null,null,null,"Total",null,"Docentes",null,"Alumnos",null,"Mujeres",null,"Gestantes",null,"Puerperas"]
[32,null,null,null,"Adulto Mayor",null,null,null,null,null,null,null,null,null,null,null,null,"Prevención: Grupos de Riesgo",null,null,"Nº","Personas","Nº","Personas","Nº","Personas","Nº","Personas","Nº","Personas","Nº","Personas"]
[33,"5000804",1,"Rehabilitación Protésica","N°",null,null,null,null,null,null,null,null,null,null,null,null,"Sesión Educativa",null,null,{"$f":"SUM(W59,Y59,AA59,AC59,AE59)","v":0},{"$f":"SUM(X59,Z59,AB59,AD59,AF59)","v":0},{"$f":"SUM(GETPIVOTDATA(\"suma de B_GR_Edu_doce_Act\",TD!$A$86))","v":0},{"$f":"SUM(GETPIVOTDATA(\"suma de B_GR_Edu_doce_pers\",TD!$A$86))","v":0},{"$f":"SUM(GETPIVOTDATA(\"suma de B_GR_Edu_alu_Act\",TD!$A$86))","v":0},{"$f":"SUM(GETPIVOTDATA(\"suma de B_GR_Edu_alu_pers\",TD!$A$86))","v":0},{"$f":"SUM(GETPIVOTDATA(\"suma de B_GR_Edu_mujer_Act\",TD!$A$86))","v":0},{"$f":"SUM(GETPIVOTDATA(\"suma de B_GR_Edu_mujer_pers\",TD!$A$86))","v":0},{"$f":"SUM(GETPIVOTDATA(\"suma de B_GR_Edu_gest_Act\",TD!$A$86))","v":0},{"$f":"SUM(GETPIVOTDATA(\"suma de B_GR_Edu_gest_pers\",TD!$A$86))","v":0},{"$f":"SUM(GETPIVOTDATA(\"suma de B_GR_Edu_puerp_Act\",TD!$A$86))","v":0},{"$f":"SUM(GETPIVOTDATA(\"suma de B_GR_Edu_puerp_pers\",TD!$A$86))","v":0}]
[34,null,null,"Impresión Primaria        = IP",{"$f":"SUM(GETPIVOTDATA(\"Suma de B_RehabProtesica_ip_AdultoM\",TD!$A$62))","v":0},null,null,null,null,null,null,null,null,null,null,null,null,"Sesión Demostrativa",null,null,{"$f":"SUM(W60,Y60,AA60,AC60,AE60)","v":0},{"$f":"SUM(X60,Z60,AB60,AD60,AF60)","v":0},{"$f":"SUM(GETPIVOTDATA(\"suma de B_GR_Dem_doce_Act\",TD!$A$86))","v":0},{"$f":"SUM(GETPIVOTDATA(\"suma de B_GR_Dem_doce_pers\",TD!$A$86))","v":0},{"$f":"SUM(GETPIVOTDATA(\"suma de B_GR_Dem_alu_Act\",TD!$A$86))","v":0},{"$f":"SUM(GETPIVOTDATA(\"suma de B_GR_Dem_alu_pers\",TD!$A$86))","v":0},{"$f":"SUM(GETPIVOTDATA(\"suma de B_GR_Dem_mujer_Act\",TD!$A$86))","v":0},{"$f":"SUM(GETPIVOTDATA(\"suma de B_GR_Dem_mujer_pers\",TD!$A$86))","v":0},{"$f":"SUM(GETPIVOTDATA(\"suma de B_GR_Dem_gest_Act\",TD!$A$86))","v":0},{"$f":"SUM(GETPIVOTDATA(\"suma de B_GR_Dem_gest_pers\",TD!$A$86))","v":0},{"$f":"SUM(GETPIVOTDATA(\"suma de B_GR_Dem_puerp_Act\",TD!$A$86))","v":0},{"$f":"SUM(GETPIVOTDATA(\"suma de B_GR_Dem_puerp_pers\",TD!$A$86))","v":0}]
[35,null,null,"Impresión Defenitiva     = ID",{"$f":"SUM(GETPIVOTDATA(\"Suma de B_RehabProtesica_id_AdultoM\",TD!$A$62))","v":0}]
[null,null,null,"Relación Intermaxilar    = RI",{"$f":"SUM(GETPIVOTDATA(\"Suma de B_RehabProtesica_ri_AdultoM\",TD!$A$62))","v":0},null,null,null,null,null,null,null,null,null,null,null,null,null,null,"Total",null,"Niño",null,"Adolescente",null,"Joven",null,"Adulto",null,"Adulto Mayor"]
[null,null,null,"Prueba de Enfilado        = PEN",{"$f":"SUM(GETPIVOTDATA(\"Suma de B_RehabProtesica_pen_AdultoM\",TD!$A$62))","v":0},null,null,null,null,null,null,null,null,null,null,null,null,"Prevención: Curso de Vida",null,"Nº","Personas","Nº","Personas","Nº","Personas","Nº","Personas","Nº","Personas","Nº","Personas"]
[null,null,null,"Instalación de Protesis  = IN",{"$f":"SUM(GETPIVOTDATA(\"Suma de B_RehabProtesica_in_AdultoM\",TD!$A$62))","v":0},null,null,null,null,null,null,null,null,null,null,null,null,"Sesión Educativa",null,{"$f":"SUM(V64,X64,Z64,AB64,AD64)","v":0},{"$f":"SUM(W64,Y64,AA64,AC64,AE64)","v":0},{"$f":"SUM(GETPIVOTDATA(\"suma de B_GR_Edu_niño_Act\",TD!$A$86))","v":0},{"$f":"SUM(GETPIVOTDATA(\"suma de B_GR_Edu_niño_pers\",TD!$A$86))","v":0},{"$f":"SUM(GETPIVOTDATA(\"suma de B_GR_Edu_adoles_Act\",TD!$A$86))","v":0},{"$f":"SUM(GETPIVOTDATA(\"suma de B_GR_Edu_adoles_pers\",TD!$A$86))","v":0},{"$f":"SUM(GETPIVOTDATA(\"suma de B_GR_Edu_joven_Act\",TD!$A$86))","v":0},{"$f":"SUM(GETPIVOTDATA(\"suma de B_GR_Edu_joven_pers\",TD!$A$86))","v":0},{"$f":"SUM(GETPIVOTDATA(\"suma de B_GR_Edu_adulto_Act\",TD!$A$86))","v":0},{"$f":"SUM(GETPIVOTDATA(\"suma de B_GR_Edu_adulto_pers\",TD!$A$86))","v":0},{"$f":"SUM(GETPIVOTDATA(\"suma de B_GR_Edu_adultom_Act\",TD!$A$86))","v":0},{"$f":"SUM(GETPIVOTDATA(\"suma de B_GR_Edu_adultom_pers\",TD!$A$86))","v":0}]
[null,null,null,"Primer Control               = 1C",{"$f":"SUM(GETPIVOTDATA(\"Suma de B_RehabProtesica_1c_AdultoM\",TD!$A$62))","v":0},null,null,null,null,null,null,null,null,null,null,null,null,"Sesión Demostrativa",null,{"$f":"SUM(V65,X65,Z65,AB65,AD65)","v":0},{"$f":"SUM(W65,Y65,AA65,AC65,AE65)","v":0},{"$f":"SUM(GETPIVOTDATA(\"suma de B_GR_Dem_niño_Act\",TD!$A$86))","v":0},{"$f":"SUM(GETPIVOTDATA(\"suma de B_GR_Dem_niño_pers\",TD!$A$86))","v":0},{"$f":"SUM(GETPIVOTDATA(\"suma de B_GR_Dem_adoles_Act\",TD!$A$86))","v":0},{"$f":"SUM(GETPIVOTDATA(\"suma de B_GR_Dem_adoles_pers\",TD!$A$86))","v":0},{"$f":"SUM(GETPIVOTDATA(\"suma de B_GR_Dem_joven_Act\",TD!$A$86))","v":0},{"$f":"SUM(GETPIVOTDATA(\"suma de B_GR_Dem_joven_pers\",TD!$A$86))","v":0},{"$f":"SUM(GETPIVOTDATA(\"suma de B_GR_Dem_adulto_Act\",TD!$A$86))","v":0},{"$f":"SUM(GETPIVOTDATA(\"suma de B_GR_Dem_adulto_pers\",TD!$A$86))","v":0},{"$f":"SUM(GETPIVOTDATA(\"suma de B_GR_Dem_adultom_Act\",TD!$A$86))","v":0},{"$f":"SUM(GETPIVOTDATA(\"suma de B_GR_Dem_adultom_pers\",TD!$A$86))","v":0}]
[null,null,null,"Segundo Control            = 2C",{"$f":"SUM(GETPIVOTDATA(\"Suma de B_RehabProtesica_2c_AdultoM\",TD!$A$62))","v":0}]
[null,null,null,null,null,null,null,null,null,null,null,null,null,null,null,null,null,"ATENDIDOS",null,null,null,null,null,null,"ATENCIONES"]
[null,null,null,null,null,null,null,null,null,null,null,null,null,null,null,null,null,"Total","Niño","Adolescente","Joven","Adulto","Adulto Mayor","Gestante","Total","Niño","Adolescente","Joven","Adulto","Adulto Mayor","Gestante"]
[null,null,null,null,null,null,null,null,null,null,null,null,null,null,null,null,null,{"$f":"SUM(S69:X69)","v":39846},{"$f":"SUM(GETPIVOTDATA(\"Suma de B_ATD_Niños\",TD!$A$86))","v":15161},{"$f":"SUM(GETPIVOTDATA(\"Suma de B_ATD_adolesc\",TD!$A$86))","v":6456},{"$f":"SUM(GETPIVOTDATA(\"Suma de B_ATD_joven\",TD!$A$86))","v":5444},{"$f":"SUM(GETPIVOTDATA(\"Suma de B_ATD_adulto\",TD!$A$86))","v":8530},{"$f":"SUM(GETPIVOTDATA(\"Suma de B_ATD_adultom\",TD!$A$86))","v":2978},{"$f":"SUM(GETPIVOTDATA(\"Suma de B_ATD_gest\",TD!$A$86))","v":1277},{"$f":"SUM(Z69:AE69)","v":61115},{"$f":"SUM(GETPIVOTDATA(\"Suma de B_ATC_Niños\",TD!$A$86))","v":24498},{"$f":"SUM(GETPIVOTDATA(\"Suma de B_ATC_adolesc\",TD!$A$86))","v":9380},{"$f":"SUM(GETPIVOTDATA(\"Suma de B_ATC_joven\",TD!$A$86))","v":8305},{"$f":"SUM(GETPIVOTDATA(\"Suma de B_ATC_adulto\",TD!$A$86))","v":12233},{"$f":"SUM(GETPIVOTDATA(\"Suma de B_ATC_adultom\",TD!$A$86))","v":4330},{"$f":"SUM(GETPIVOTDATA(\"Suma de B_ATC_gest\",TD!$A$86))","v":2369}]
[]
[null,null,null,null,"Cursos de Vida",null,null,null,null,null,null,null,null,null,null,null,null,null,null,null,null,null,null,null,"Cursos de Vida"]
[null,null,null,null,"3 - 5 años",null,"6 - 11 años",null,"Adolescente",null,"Joven",null,"Adulto",null,"Adulto Mayor",null,"Gestante",null,null,null,null,null,null,null,"3 - 5 años","6 - 11 años","Adolescente",null,"Joven","Adulto","Adulto Mayor","Gestante"]
[null,"Procedimiento de Inactivación de Caries",null,null,"N°",null,"N°",null,"N°",null,"N°",null,"N°",null,"N°",null,"N°",null,null,"Procedimiento de Interconsulta,Referencia y Contrareferencia",null,null,null,null,"N°","N°","N°",null,"N°","N°","N°","N°"]
[null,"Inactivación de Caries con Fluoruro de Amino Plata = F",null,null,{"$f":"SUM(GETPIVOTDATA(\"Suma de B_InactivaC_F_3_5a\",TD!$A$86))","v":6},null,{"$f":"SUM(GETPIVOTDATA(\"Suma de B_InactivaC_F_6_11a\",TD!$A$86))","v":2},null,{"$f":"SUM(GETPIVOTDATA(\"Suma de B_InactivaC_F_Adolesc\",TD!$A$86))","v":0},null,{"$f":"SUM(GETPIVOTDATA(\"Suma de B_InactivaC_F_JOven\",TD!$A$86))","v":0},null,{"$f":"SUM(GETPIVOTDATA(\"Suma de B_InactivaC_F_Adulto\",TD!$A$86))","v":0},null,{"$f":"SUM(GETPIVOTDATA(\"Suma de B_InactivaC_F_AdultoM\",TD!$A$86))","v":0},null,{"$f":"SUM(GETPIVOTDATA(\"Suma de B_InactivaC_F_g\",TD!$A$86))","v":0},null,null,"Interconsulta de Hospitalizacion",null,null,null,null,{"$f":"SUM(GETPIVOTDATA(\"Suma de B_InterConsulHosp_3_5a\",TD!$A$86))","v":1},{"$f":"SUM(GETPIVOTDATA(\"Suma de B_InterConsulHosp_6_11a\",TD!$A$86))","v":3},{"$f":"SUM(GETPIVOTDATA(\"Suma de B_InterConsulHosp_Adolesc\",TD!$A$86))","v":1},null,{"$f":"SUM(GETPIVOTDATA(\"Suma de B_InterConsulHosp_JOven\",TD!$A$86))","v":6},{"$f":"SUM(GETPIVOTDATA(\"Suma de B_InterConsulHosp_Adulto\",TD!$A$86))","v":2},{"$f":"SUM(GETPIVOTDATA(\"Suma de B_InterConsulHosp_AdultoM\",TD!$A$86))","v":8},{"$f":"SUM(GETPIVOTDATA(\"Suma de B_InterConsulHosp_gest\",TD!$A$86))","v":2}]
[null,"Inactivación de Caries con Resina = R",null,null,{"$f":"SUM(GETPIVOTDATA(\"Suma de B_InactivaC_R_3_5a\",TD!$A$86))","v":0},null,{"$f":"SUM(GETPIVOTDATA(\"Suma de B_InactivaC_R_6_11a\",TD!$A$86))","v":0},null,{"$f":"SUM(GETPIVOTDATA(\"Suma de B_InactivaC_R_Adolesc\",TD!$A$86))","v":0},null,{"$f":"SUM(GETPIVOTDATA(\"Suma de B_InactivaC_R_JOven\",TD!$A$86))","v":0},null,{"$f":"SUM(GETPIVOTDATA(\"Suma de B_InactivaC_R_Adulto\",TD!$A$86))","v":0},null,{"$f":"SUM(GETPIVOTDATA(\"Suma de B_InactivaC_R_AdultoM\",TD!$A$86))","v":0},null,{"$f":"SUM(GETPIVOTDATA(\"Suma de B_InactivaC_R_g\",TD!$A$86))","v":0},null,null,"Interconsulta Ambulatoria",null,null,null,null,{"$f":"SUM(GETPIVOTDATA(\"Suma de B_InterConsulAmb_3_5a\",TD!$A$86))","v":0},{"$f":"SUM(GETPIVOTDATA(\"Suma de B_InterConsulAmb_6_11a\",TD!$A$86))","v":0},{"$f":"SUM(GETPIVOTDATA(\"Suma de B_InterConsulAmb_Adolesc\",TD!$A$86))","v":0},null,{"$f":"SUM(GETPIVOTDATA(\"Suma de B_InterConsulAmb_JOven\",TD!$A$86))","v":0},{"$f":"SUM(GETPIVOTDATA(\"Suma de B_InterConsulAmb_Adulto\",TD!$A$86))","v":0},{"$f":"SUM(GETPIVOTDATA(\"Suma de B_InterConsulAmb_AdultoM\",TD!$A$86))","v":0},{"$f":"SUM(GETPIVOTDATA(\"Suma de B_InterConsulAmb_gest\",TD!$A$86))","v":0}]
[null,"Inactivación de Caries con Ionomero de Vidrio = IV",null,null,{"$f":"SUM(GETPIVOTDATA(\"Suma de B_InactivaC_IV_3_5a\",TD!$A$86))","v":0},null,{"$f":"SUM(GETPIVOTDATA(\"Suma de B_InactivaC_IV_6_11a\",TD!$A$86))","v":0},null,{"$f":"SUM(GETPIVOTDATA(\"Suma de B_InactivaC_IV_Adolesc\",TD!$A$86))","v":0},null,{"$f":"SUM(GETPIVOTDATA(\"Suma de B_InactivaC_IV_JOven\",TD!$A$86))","v":0},null,{"$f":"SUM(GETPIVOTDATA(\"Suma de B_InactivaC_IV_Adulto\",TD!$A$86))","v":0},null,{"$f":"SUM(GETPIVOTDATA(\"Suma de B_InactivaC_IV_AdultoM\",TD!$A$86))","v":0},null,{"$f":"SUM(GETPIVOTDATA(\"Suma de B_InactivaC_IV_g\",TD!$A$86))","v":0},null,null,"Referencia a EE.SS. con capacidad resolutiva",null,null,null,null,{"$f":"SUM(GETPIVOTDATA(\"Suma de B_Referencia_3_5a\",TD!$A$86))","v":6},{"$f":"SUM(GETPIVOTDATA(\"Suma de B_Referencia_6_11a\",TD!$A$86))","v":2},{"$f":"SUM(GETPIVOTDATA(\"Suma de B_Referencia_Adolesc\",TD!$A$86))","v":1},null,{"$f":"SUM(GETPIVOTDATA(\"Suma de B_Referencia_JOven\",TD!$A$86))","v":1},{"$f":"SUM(GETPIVOTDATA(\"Suma de B_Referencia_Adulto\",TD!$A$86))","v":4},{"$f":"SUM(GETPIVOTDATA(\"Suma de B_Referencia_AdultoM\",TD!$A$86))","v":3},{"$f":"SUM(GETPIVOTDATA(\"Suma de B_Referencia_gest\",TD!$A$86))","v":0}]
[null,null,null,null,null,null,null,null,null,null,null,null,null,null,null,null,null,null,null,"Contrarreferencia",null,null,null,null,{"$f":"SUM(GETPIVOTDATA(\"Suma de B_CReferencia_3_5a\",TD!$A$86))","v":14},{"$f":"SUM(GETPIVOTDATA(\"Suma de B_CReferencia_6_11a\",TD!$A$86))","v":6},{"$f":"SUM(GETPIVOTDATA(\"Suma de B_CReferencia_Adolesc\",TD!$A$86))","v":3},null,{"$f":"SUM(GETPIVOTDATA(\"Suma de B_CReferencia_JOven\",TD!$A$86))","v":2},{"$f":"SUM(GETPIVOTDATA(\"Suma de B_CReferencia_Adulto\",TD!$A$86))","v":3},{"$f":"SUM(GETPIVOTDATA(\"Suma de B_CReferencia_AdultoM\",TD!$A$86))","v":3},{"$f":"SUM(GETPIVOTDATA(\"Suma de B_Referencia_gest\",TD!$A$86))","v":0}]
[]
[null,null,null,null,null,null,null,"Actividades",null,null,null,"N°"]
[null,null,null,null,null,null,null,"Monitoreo = C7001",null,null,null,{"$f":"SUM(GETPIVOTDATA(\"Suma de B_Monitoreo\",TD!$A$86))","v":0}]
[null,null,null,null,null,null,null,"Supervisión = C7002",null,null,null,{"$f":"SUM(GETPIVOTDATA(\"Suma de B_Supervicion\",TD!$A$86))","v":0}]
[null,null,null,null,null,null,null,"Evaluación = C7003",null,null,null,{"$f":"SUM(GETPIVOTDATA(\"Suma de B_Evaluacion\",TD!$A$86))","v":0}]
[null,null,null,null,null,null,null,"Asistencia Técnica = C7004",null,null,null,{"$f":"SUM(GETPIVOTDATA(\"Suma de B_Asistecnica\",TD!$A$86))","v":0}]
[]
[null,"ACTIVIDADES EN SALUD BUCAL REALIZADAS A TRAVÉS DE TELESALUD",null,null,"Total",null,"Curso de Vida\nNiño",null,null,null,null,null,null,null,null,null,null,null,null,null,"Cursos de Vida",null,null,null,null,null,null,null,"GESTANTE"]
[null,null,null,null,null,null,"0 - 28d",null,"29 - 5m",null,"6m - 11m",null,"1 año",null,"2 años",null,"3 a 5 años",null,"6 a 11 años",null,"Adolescente",null,"Joven",null,"Adulto",null,"Adulto Mayor"]
[null,"Teleorientación Síncrona",null,null,{"$f":"SUM(G87:AD87)","v":0},null,{"$f":"SUM(GETPIVOTDATA(\"Suma de B_TeleOriSinc_0_28d\",TD!$A$86))","v":0},null,{"$f":"SUM(GETPIVOTDATA(\"Suma de B_TeleOriSinc_29_5m\",TD!$A$86))","v":0},null,{"$f":"SUM(GETPIVOTDATA(\"Suma de B_TeleOriSinc_6_11m\",TD!$A$86))","v":0},null,{"$f":"SUM(GETPIVOTDATA(\"Suma de B_TeleOriSinc_1a\",TD!$A$86))","v":0},null,{"$f":"SUM(GETPIVOTDATA(\"Suma de B_TeleOriSinc_2a\",TD!$A$86))","v":0},null,{"$f":"SUM(GETPIVOTDATA(\"Suma de B_TeleOriSinc_3_5a\",TD!$A$86))","v":0},null,{"$f":"SUM(GETPIVOTDATA(\"Suma de B_TeleOriSinc_6_11a\",TD!$A$86))","v":0},null,{"$f":"SUM(GETPIVOTDATA(\"Suma de B_TeleOriSinc_Adolesc\",TD!$A$86))","v":0},null,{"$f":"SUM(GETPIVOTDATA(\"Suma de B_TeleOriSinc_Joven\",TD!$A$86))","v":0},null,{"$f":"SUM(GETPIVOTDATA(\"Suma de B_TeleOriSinc_Adulto\",TD!$A$86))","v":0},null,{"$f":"SUM(GETPIVOTDATA(\"Suma de B_TeleOriSinc_AdultoM\",TD!$A$86))","v":0},null,{"$f":"SUM(GETPIVOTDATA(\"Suma de B_TeleOriSinc_gest\",TD!$A$86))","v":0}]
[null,"Teleorientación Síncrona - Salud Bucal - Atención Preventiva (Asesoría Nutricional y Instrucción de Higiene Oral)",null,null,{"$f":"+G88+M88+O88+Q88+U88+W88+Y88+AC88+S88+AA88+I88+K88","v":0},null,{"$f":"SUM(GETPIVOTDATA(\"Suma de B_TeleOriSinc_ap_0_28d\",TD!$A$86))","v":0},null,{"$f":"SUM(GETPIVOTDATA(\"Suma de B_TeleOriSinc_ap_29_5m\",TD!$A$86))","v":0},null,{"$f":"SUM(GETPIVOTDATA(\"Suma de B_TeleOriSinc_ap_6_11m\",TD!$A$86))","v":0},null,{"$f":"SUM(GETPIVOTDATA(\"Suma de B_TeleOriSinc_ap_1a\",TD!$A$86))","v":0},null,{"$f":"SUM(GETPIVOTDATA(\"Suma de B_TeleOriSinc_2a\",TD!$A$86))","v":0},null,{"$f":"SUM(GETPIVOTDATA(\"Suma de B_TeleOriSinc_AP_3_5a\",TD!$A$86))","v":0},null,{"$f":"SUM(GETPIVOTDATA(\"Suma de B_TeleOriSinc_AP_6_11a\",TD!$A$86))","v":0},null,{"$f":"SUM(GETPIVOTDATA(\"Suma de B_TeleOriSinc_AP_Adolesc\",TD!$A$86))","v":0},null,{"$f":"SUM(GETPIVOTDATA(\"Suma de B_TeleOriSinc_AP_Joven\",TD!$A$86))","v":0},null,{"$f":"SUM(GETPIVOTDATA(\"Suma de B_TeleOriSinc_AP_Adulto\",TD!$A$86))","v":0},null,{"$f":"SUM(GETPIVOTDATA(\"Suma de B_TeleOriSinc_AP_AdultoM\",TD!$A$86))","v":0},null,{"$f":"SUM(GETPIVOTDATA(\"Suma de B_TeleOriSinc_AP_gest\",TD!$A$86))","v":0}]
[null,"Telemonitoreo",null,null,{"$f":"+G89+M89+O89+Q89+U89+W89+Y89+AC89+S89+AA89+I89+K89","v":0},null,{"$f":"SUM(GETPIVOTDATA(\"Suma de B_Telemonitoreo_0_28d\",TD!$A$86))","v":0},null,{"$f":"SUM(GETPIVOTDATA(\"Suma de B_Telemonitoreo_29_5m\",TD!$A$86))","v":0},null,{"$f":"SUM(GETPIVOTDATA(\"Suma de B_Telemonitoreo_6_11m\",TD!$A$86))","v":0},null,{"$f":"SUM(GETPIVOTDATA(\"Suma de B_Telemonitoreo_1a\",TD!$A$86))","v":0},null,{"$f":"SUM(GETPIVOTDATA(\"Suma de B_Telemonitoreo_2a\",TD!$A$86))","v":0},null,{"$f":"SUM(GETPIVOTDATA(\"Suma de B_Telemonitoreo_3_5a\",TD!$A$86))","v":0},null,{"$f":"SUM(GETPIVOTDATA(\"Suma de B_Telemonitoreo_6_11a\",TD!$A$86))","v":0},null,{"$f":"SUM(GETPIVOTDATA(\"Suma de B_Telemonitoreo_Adolesc\",TD!$A$86))","v":0},null,{"$f":"SUM(GETPIVOTDATA(\"Suma de B_Telemonitoreo_Joven\",TD!$A$86))","v":0},null,{"$f":"SUM(GETPIVOTDATA(\"Suma de B_Telemonitoreo_Adulto\",TD!$A$86))","v":0},null,{"$f":"SUM(GETPIVOTDATA(\"Suma de B_Telemonitoreo_AdultoM\",TD!$A$86))","v":0},null,{"$f":"SUM(GETPIVOTDATA(\"Suma de B_Telemonitoreo_gest\",TD!$A$86))","v":0}]
[null,"Teleinterconsulta Síncrona (teleinterconsultante)",null,null,{"$f":"+G90+M90+O90+Q90+U90+W90+Y90+AC90+S90+AA90+I90+K90","v":1},null,{"$f":"SUM(GETPIVOTDATA(\"Suma de B_TSInterconsultante_0_28d\",TD!$A$86))","v":0},null,{"$f":"SUM(GETPIVOTDATA(\"Suma de B_TSInterconsultante_29_5m\",TD!$A$86))","v":0},null,{"$f":"SUM(GETPIVOTDATA(\"Suma de B_TSInterconsultante_6_11m\",TD!$A$86))","v":0},null,{"$f":"SUM(GETPIVOTDATA(\"Suma de B_TSInterconsultante_1a\",TD!$A$86))","v":0},null,{"$f":"SUM(GETPIVOTDATA(\"Suma de B_TSInterconsultante_2a\",TD!$A$86))","v":0},null,{"$f":"SUM(GETPIVOTDATA(\"Suma de B_TSInterconsultante_3_5a\",TD!$A$86))","v":0},null,{"$f":"SUM(GETPIVOTDATA(\"Suma de B_TSInterconsultante_6_11a\",TD!$A$86))","v":0},null,{"$f":"SUM(GETPIVOTDATA(\"Suma de B_TSInterconsultante_Adolesc\",TD!$A$86))","v":0},null,{"$f":"SUM(GETPIVOTDATA(\"Suma de B_TSInterconsultante_Joven\",TD!$A$86))","v":0},null,{"$f":"SUM(GETPIVOTDATA(\"Suma de B_TSInterconsultante_Adulto\",TD!$A$86))","v":1},null,{"$f":"SUM(GETPIVOTDATA(\"Suma de B_TSInterconsultante_AdultoM\",TD!$A$86))","v":0},null,{"$f":"SUM(GETPIVOTDATA(\"Suma de B_TSInterconsultante_gest\",TD!$A$86))","v":0}]
[null,"Teleinterconsulta Síncrona (teleinterconsultor)",null,null,{"$f":"+G91+M91+O91+Q91+U91+W91+Y91+AC91+S91+AA91+I91+K91","v":0},null,{"$f":"SUM(GETPIVOTDATA(\"Suma de B_TSInterconsultor_0_28d\",TD!$A$86))","v":0},null,{"$f":"SUM(GETPIVOTDATA(\"Suma de B_TSInterconsultor_29_5m\",TD!$A$86))","v":0},null,{"$f":"SUM(GETPIVOTDATA(\"Suma de B_TSInterconsultor_6_11m\",TD!$A$86))","v":0},null,{"$f":"SUM(GETPIVOTDATA(\"Suma de B_TSInterconsultor_1a\",TD!$A$86))","v":0},null,{"$f":"SUM(GETPIVOTDATA(\"Suma de B_TSInterconsultor_2a\",TD!$A$86))","v":0},null,{"$f":"SUM(GETPIVOTDATA(\"Suma de B_TSInterconsultor_3_5a\",TD!$A$86))","v":0},null,{"$f":"SUM(GETPIVOTDATA(\"Suma de B_TSInterconsultor_6_11a\",TD!$A$86))","v":0},null,{"$f":"SUM(GETPIVOTDATA(\"Suma de B_TSInterconsultor_Adolesc\",TD!$A$86))","v":0},null,{"$f":"SUM(GETPIVOTDATA(\"Suma de B_TSInterconsultor_Joven\",TD!$A$86))","v":0},null,{"$f":"SUM(GETPIVOTDATA(\"Suma de B_TSInterconsultor_Adulto\",TD!$A$86))","v":0},null,{"$f":"SUM(GETPIVOTDATA(\"Suma de B_TSInterconsultor_AdultoM\",TD!$A$86))","v":0},null,{"$f":"SUM(GETPIVOTDATA(\"Suma de B_TSInterconsultor_gest\",TD!$A$86))","v":0}]

{"sheet":"Avance_Meta_Fisica_Pob_Asignada","index":4,"n_rows":79,"n_cols":17,"rows_kept":79,"cut":false,"hidden":false,"merged":[[15,5,15,6],[15,1,15,3],[13,1,13,5],[22,0,23,0],[22,2,23,2],[22,16,23,16],[24,0,25,0],[24,2,25,2],[24,16,25,16],[22,1,23,1],[24,1,25,1],[17,2,18,2],[17,3,18,3],[17,4,18,4],[17,5,17,11],[17,16,18,16],[20,0,21,0],[20,2,21,2],[20,16,21,16],[20,1,21,1],[17,1,18,1],[30,16,31,16],[32,0,33,0],[32,2,33,2],[32,16,33,16],[30,1,31,1],[32,1,33,1],[26,0,27,0],[26,2,27,2],[26,16,27,16],[28,0,29,0],[28,2,29,2],[28,16,29,16],[26,1,27,1],[28,1,29,1],[35,2,35,5],[44,2,45,2],[44,3,45,3],[44,4,45,4],[44,5,44,11],[41,1,41,5],[42,1,42,3],[30,0,31,0],[30,2,31,2],[42,5,42,6],[51,0,52,0],[51,2,52,2],[51,16,52,16],[53,0,54,0],[53,2,54,2],[53,16,54,16],[44,16,45,16],[47,0,48,0],[47,2,48,2],[47,16,48,16],[49,0,50,0],[49,2,50,2],[49,16,50,16],[44,1,45,1],[47,1,48,1],[49,1,50,1],[51,1,52,1],[53,1,54,1],[62,5,62,6],[55,0,56,0],[55,2,56,2],[55,16,56,16],[57,0,58,0],[57,2,58,2],[57,16,58,16],[55,1,56,1],[57,1,58,1],[61,2,61,5],[62,2,62,3],[77,0,78,0],[77,2,78,2],[77,16,78,16],[75,1,76,1],[77,1,78,1],[71,0,72,0],[71,2,72,2],[71,16,72,16],[73,0,74,0],[73,2,74,2],[73,16,74,16],[71,1,72,1],[73,1,74,1],[75,0,76,0],[75,2,76,2],[75,16,76,16],[67,0,68,0],[67,2,68,2],[67,16,68,16],[69,0,70,0],[69,2,70,2],[69,16,70,16],[64,1,65,1],[67,1,68,1],[69,1,70,1],[64,2,65,2],[64,3,65,3],[64,4,65,4],[64,5,64,11],[64,16,65,16],[0,0,0,17],[1,0,1,17],[2,0,2,16],[3,0,3,17],[4,0,4,17],[6,3,6,6],[8,3,8,6],[10,3,10,6],[6,10,6,13],[8,10,8,13],[10,10,10,13]]}
["GERENCIA REGIONAL DE SALUD CUSCO"]
["DIRECCION EJECUTIVA DE INTELIGENCIA SANITARIA"]
["DIRECCION DE ESTADISTICA INFORMATICA Y TELECOMUNICACIONES"]
["SALUD BUCAL"]
["INFORME DE AVANCES DE METAS FISICAS SIS CON POBLACION ASIGNADA"]
[]
[null,null,"RED DE SALUD",{"$f":"TD!F3","v":"LA CONVENCION"},null,null,null,null,"PROVINCIA",null,{"$f":"TD!F6","v":"(All)"},null,null,null,null,"AÑO :",{"$f":"TD!C10","v":"2024"}]
[]
[null,null,"MICRO RED",{"$f":"TD!F4","v":"(All)"},null,null,null,null,"DISTRITO",null,{"$f":"TD!F7","v":"(All)"},null,null,null,null,"MES :",{"$f":"TD!O17","v":"ENERO - NOVIEMBRE"}]
[]
[null,null,"ESTABLECIMIENTO",{"$f":"TD!F5","v":"(All)"},null,null,null,null,"U.E.",null,{"$f":"TD!F8","v":"(All)"}]
[]
[]
[null,"PRODUCTO: ATENCIÓN ESTOMATOLOGICA PREVENTIVA (3000680)"]
[]
[null,"AVANCE  DE META FISICA A NIVEL DE PRODUCTO ",null,null," PERSONA ATENDIDA",{"$f":"+Q21+Q23+Q25+Q27+Q29+Q31+Q33","v":18510}]
[]
[null,"PpR","SUB PRODUCTO","CODICION","UNIDAD DE MEDIDA","CURSO DE VIDA \nNIÑO",null,null,null,null,null,null,"CURSO DE VIDA\n ADOLESCENTE","CURSO DE VIDA \nJOVEN","CURSO DE VIDA\n ADULTO ","CURSO DE VIDA\n ADULTO MAYOR","AVANCE  DE META FISICA A NIVEL DE SUB PRODUCTOS"]
[null,null,null,null,null,"0 - 28d","29d - 5m","6m - 11m","1 año ","2 años","3a - 5a","6a - 11a","12a - 17a","18a - 29a","30a - 59a","60 años a mas"]
[]
[1,"0068001","ASESORÍA NUTRICIONAL PARA EL CONTROL DE ENFERMEDADES DENTALES","NO GESTANTE","PERSONA ATENDIDA",{"$f":"SUM(GETPIVOTDATA(\"Suma de B_ANCEDN_CT_0_28d\",TD!$A$113))","v":0},{"$f":"SUM(GETPIVOTDATA(\"Suma de B_ANCEDN_CT_29_5m\",TD!$A$113))","v":7},{"$f":"SUM(GETPIVOTDATA(\"Suma de B_ANCEDN_CT_6_11m\",TD!$A$113))","v":16},{"$f":"SUM(GETPIVOTDATA(\"Suma de B_ANCEDN_CT_1a\",TD!$A$113))","v":33},{"$f":"SUM(GETPIVOTDATA(\"Suma de B_ANCEDN_CT_2a\",TD!$A$113))","v":22},{"$f":"SUM(GETPIVOTDATA(\"Suma de B_ANCEDN_CT_3_5a\",TD!$A$113))","v":355},{"$f":"SUM(GETPIVOTDATA(\"Suma de B_ANCEDN_CT_6_11a\",TD!$A$113))","v":983},{"$f":"SUM(GETPIVOTDATA(\"Suma de B_ANCEDN_CT_Adolesc\",TD!$A$113))","v":368},{"$f":"SUM(GETPIVOTDATA(\"Suma de B_ANCEDN_CT_Joven\",TD!$A$113))","v":157},{"$f":"SUM(GETPIVOTDATA(\"Suma de B_ANCEDN_CT_Adulto\",TD!$A$113))","v":167},{"$f":"SUM(GETPIVOTDATA(\"Suma de B_ANCEDN_CT_AdultoM\",TD!$A$113))","v":66},{"$f":"SUM(F21+G21+H21+I21+J21+K21+L21+M21+N21+O21+P21)","v":2174}]
[null,null,null," GESTANTE","PERSONA ATENDIDA",null,null,null,null,null,null,{"$f":"SUM(GETPIVOTDATA(\"Suma de B_ANCEDN_CT_6_11a_g\",TD!$A$113))","v":0},{"$f":"SUM(GETPIVOTDATA(\"Suma de B_ANCEDN_CT_Adol_g\",TD!$A$113))","v":22},{"$f":"SUM(GETPIVOTDATA(\"Suma de B_ANCEDN_CT_Joven_g\",TD!$A$113))","v":164},{"$f":"SUM(GETPIVOTDATA(\"Suma de B_ANCEDN_CT_Adulto_g\",TD!$A$113))","v":148}]
[2,"0068002","EXAMEN ESTOMATOLÓGICO","NO GESTANTE","PERSONA ATENDIDA",{"$f":"SUM(GETPIVOTDATA(\"Suma de B_EXODONN_CT_0_28d\",TD!$A$113))","v":8},{"$f":"SUM(GETPIVOTDATA(\"Suma de B_EXODONN_CT_29_5m\",TD!$A$113))","v":24},{"$f":"SUM(GETPIVOTDATA(\"Suma de B_EXODONN_CT_6_11m\",TD!$A$113))","v":105},{"$f":"SUM(GETPIVOTDATA(\"Suma de B_EXODONN_CT_1a\",TD!$A$113))","v":147},{"$f":"SUM(GETPIVOTDATA(\"Suma de B_EXODONN_CT_2a\",TD!$A$113))","v":165},{"$f":"SUM(GETPIVOTDATA(\"Suma de B_EXODONN_CT_3_5a\",TD!$A$113))","v":1168},{"$f":"SUM(GETPIVOTDATA(\"Suma de B_EXODONN_CT_6_11a\",TD!$A$113))","v":2068},{"$f":"SUM(GETPIVOTDATA(\"Suma de B_EXODONN_CT_Adolesc\",TD!$A$113))","v":1479},{"$f":"SUM(GETPIVOTDATA(\"Suma de B_EXODONN_CT_Joven\",TD!$A$113))","v":1248},{"$f":"SUM(GETPIVOTDATA(\"Suma de B_EXODONN_CT_Adulto\",TD!$A$113))","v":1886},{"$f":"SUM(GETPIVOTDATA(\"Suma de B_EXODONN_CT_AdultoM\",TD!$A$113))","v":699},{"$f":"SUM(F23+G23+H23+I23+J23+K23+L23+M23+N23+O23+P23)","v":8997}]
[null,null,null," GESTANTE","PERSONA ATENDIDA",null,null,null,null,null,null,{"$f":"SUM(GETPIVOTDATA(\"Suma de B_EXODONN_CT_6_11a_g\",TD!$A$113))","v":15},{"$f":"SUM(GETPIVOTDATA(\"Suma de B_EXODONN_CT_Adol_g\",TD!$A$113))","v":62},{"$f":"SUM(GETPIVOTDATA(\"Suma de B_EXODONN_CT_Joven_g\",TD!$A$113))","v":431},{"$f":"SUM(GETPIVOTDATA(\"Suma de B_EXODONN_CT_Adulto_g\",TD!$A$113))","v":327}]
[3,"0068003","INSTRUCCIÓN DE HIGIENE ORAL","NO GESTANTE","PERSONA ATENDIDA",null,null,{"$f":"SUM(GETPIVOTDATA(\"Suma de B_IHON_CT_6_11m\",TD!$A$113))","v":16},{"$f":"SUM(GETPIVOTDATA(\"Suma de B_IHON_CT_1a\",TD!$A$113))","v":33},{"$f":"SUM(GETPIVOTDATA(\"Suma de B_IHON_CT_2a\",TD!$A$113))","v":21},{"$f":"SUM(GETPIVOTDATA(\"Suma de B_IHON_CT_3_5a\",TD!$A$113))","v":355},{"$f":"SUM(GETPIVOTDATA(\"Suma de B_IHON_CT_6_11a\",TD!$A$113))","v":982},{"$f":"SUM(GETPIVOTDATA(\"Suma de B_IHON_CT_Adolesc\",TD!$A$113))","v":368},{"$f":"SUM(GETPIVOTDATA(\"Suma de B_IHON_CT_Joven\",TD!$A$113))","v":159},{"$f":"SUM(GETPIVOTDATA(\"Suma de B_IHON_CT_Adulto\",TD!$A$113))","v":167},{"$f":"SUM(GETPIVOTDATA(\"Suma de B_IHON_CT_AdultoM\",TD!$A$113))","v":66},{"$f":"SUM(H25+I25+J25+K25+L25+M25+N25+O25+P25)","v":2167}]
[null,null,null," GESTANTE","PERSONA ATENDIDA",null,null,null,null,null,null,{"$f":"SUM(GETPIVOTDATA(\"Suma de B_IHON_CT_6_11a_g\",TD!$A$113))","v":0},{"$f":"SUM(GETPIVOTDATA(\"Suma de B_IHON_CT_Adol_g\",TD!$A$113))","v":22},{"$f":"SUM(GETPIVOTDATA(\"Suma de B_IHON_CT_Joven_g\",TD!$A$113))","v":161},{"$f":"SUM(GETPIVOTDATA(\"Suma de B_IHON_CT_Adulto_g\",TD!$A$113))","v":149}]
[4,"5000601","APLICACIÓN DE SELLANTES ","NO GESTANTE","PERSONA ATENDIDA",null,null,null,null,{"$f":"SUM(GETPIVOTDATA(\"Suma de B_ASELN_CT_2a\",TD!$A$113))","v":1},{"$f":"SUM(GETPIVOTDATA(\"Suma de B_ASELN_CT_3_5a\",TD!$A$113))","v":41},{"$f":"SUM(GETPIVOTDATA(\"Suma de B_ASELN_CT_6_11a\",TD!$A$113))","v":153},{"$f":"SUM(GETPIVOTDATA(\"Suma de B_ASELN_CT_Adolesc\",TD!$A$113))","v":17},{"$f":"SUM(GETPIVOTDATA(\"Suma de B_ASELN_CT_Joven\",TD!$A$113))","v":0},{"$f":"SUM(GETPIVOTDATA(\"Suma de B_ASELN_CT_Adulto\",TD!$A$113))","v":0},{"$f":"SUM(GETPIVOTDATA(\"Suma de B_ASELN_CT_AdultoM\",TD!$A$113))","v":0},{"$f":"SUM(J27+K27+L27)","v":195}]
[null,null,null," GESTANTE","PERSONA ATENDIDA",null,null,null,null,null,null,{"$f":"SUM(GETPIVOTDATA(\"Suma de B_ASELN_CT_6_11a_g\",TD!$A$113))","v":3},{"$f":"SUM(GETPIVOTDATA(\"Suma de B_ASELN_CT_Adol_g\",TD!$A$113))","v":0},{"$f":"SUM(GETPIVOTDATA(\"Suma de B_ASELN_CT_Joven_g\",TD!$A$113))","v":0},{"$f":"SUM(GETPIVOTDATA(\"Suma de B_ASELN_CT_Adulto_g\",TD!$A$113))","v":0}]
[5,"5000602","APLICACIÓN DE FLÚOR BARNIZ","NO GESTANTE","PERSONA ATENDIDA",null,null,{"$f":"SUM(GETPIVOTDATA(\"Suma de B_ABFN_CT_6_11m\",TD!$A$113))","v":13},{"$f":"SUM(GETPIVOTDATA(\"Suma de B_ABFN_CT_1a\",TD!$A$113))","v":31},{"$f":"SUM(GETPIVOTDATA(\"Suma de B_ABFN_CT_2a\",TD!$A$113))","v":32},{"$f":"SUM(GETPIVOTDATA(\"Suma de B_ABFN_CT_3_5a\",TD!$A$113))","v":437},{"$f":"SUM(GETPIVOTDATA(\"Suma de B_ABFN_CT_6_11a\",TD!$A$113))","v":1079},{"$f":"SUM(GETPIVOTDATA(\"Suma de B_ABFN_CT_Adolesc\",TD!$A$113))","v":372},{"$f":"SUM(GETPIVOTDATA(\"Suma de B_ABFN_CT_Joven\",TD!$A$113))","v":169},{"$f":"SUM(GETPIVOTDATA(\"Suma de B_ABFN_CT_Adulto\",TD!$A$113))","v":40},{"$f":"SUM(GETPIVOTDATA(\"Suma de B_ABFN_CT_AdultoM\",TD!$A$113))","v":8},{"$f":"SUM(H29+I29+J29+K29+L29+M29+N29)","v":2133}]
[null,null,null," GESTANTE","PERSONA ATENDIDA",null,null,null,null,null,null,{"$f":"SUM(GETPIVOTDATA(\"Suma de B_ABFN_CT_6_11a_g\",TD!$A$113))","v":0},{"$f":"SUM(GETPIVOTDATA(\"Suma de B_ABFN_CT_Adol_g\",TD!$A$113))","v":20},{"$f":"SUM(GETPIVOTDATA(\"Suma de B_ABFN_CT_Joven_g\",TD!$A$113))","v":185},{"$f":"SUM(GETPIVOTDATA(\"Suma de B_ABFN_CT_Adulto_g\",TD!$A$113))","v":141}]
[6,"5000603","APLICACIÓN DE FLÚOR GEL","NO GESTANTE","PERSONA ATENDIDA",null,null,null,null,null,null,null,null,null,{"$f":"SUM(GETPIVOTDATA(\"Suma de B_AFGN_CT_Adulto\",TD!$A$113))","v":217},{"$f":"SUM(GETPIVOTDATA(\"Suma de B_AFGN_CT_AdultoM\",TD!$A$113))","v":74},{"$f":"SUM(O31+P31+O32)","v":322}]
[null,null,null," GESTANTE","PERSONA ATENDIDA",null,null,null,null,null,null,{"$f":"SUM(GETPIVOTDATA(\"Suma de B_AFGN_CT_6_11a_g\",TD!$A$113))","v":0},{"$f":"SUM(GETPIVOTDATA(\"Suma de B_AFGN_CT_Adol_g\",TD!$A$113))","v":2},{"$f":"SUM(GETPIVOTDATA(\"Suma de B_AFGN_CT_Joven_g\",TD!$A$113))","v":13},{"$f":"SUM(GETPIVOTDATA(\"Suma de B_AFGN_CT_Adulto_g\",TD!$A$113))","v":31}]
[7,"5000606","PROFILAXIS DENTAL","NO GESTANTE","PERSONA ATENDIDA",null,null,{"$f":"SUM(GETPIVOTDATA(\"Suma de B_PDN_CT_6_11m\",TD!$A$113))","v":10},{"$f":"SUM(GETPIVOTDATA(\"Suma de B_PDN_CT_1a\",TD!$A$113))","v":26},{"$f":"SUM(GETPIVOTDATA(\"Suma de B_PDN_CT_2a\",TD!$A$113))","v":33},{"$f":"SUM(GETPIVOTDATA(\"Suma de B_PDN_CT_3_5a\",TD!$A$113))","v":414},{"$f":"SUM(GETPIVOTDATA(\"Suma de B_PDN_CT_6_11a\",TD!$A$113))","v":1052},{"$f":"SUM(GETPIVOTDATA(\"Suma de B_PDN_CT_Adolesc\",TD!$A$113))","v":402},{"$f":"SUM(GETPIVOTDATA(\"Suma de B_PDN_CT_Joven\",TD!$A$113))","v":246},{"$f":"SUM(GETPIVOTDATA(\"Suma de B_PDN_CT_Adulto\",TD!$A$113))","v":245},{"$f":"SUM(GETPIVOTDATA(\"Suma de B_PDN_CT_AdultoM\",TD!$A$113))","v":94},{"$f":"SUM(H33+I33+J33+K33+L33+M33+N33+O33+P33)","v":2522}]
[null,null,null," GESTANTE","PERSONA ATENDIDA",null,null,null,null,null,null,{"$f":"SUM(GETPIVOTDATA(\"Suma de B_PDN_CT_6_11a_g\",TD!$A$113))","v":0},{"$f":"SUM(GETPIVOTDATA(\"Suma de B_PDN_CT_Adol_g\",TD!$A$113))","v":23},{"$f":"SUM(GETPIVOTDATA(\"Suma de B_PDN_CT_Joven_g\",TD!$A$113))","v":200},{"$f":"SUM(GETPIVOTDATA(\"Suma de B_PDN_CT_Adulto_g\",TD!$A$113))","v":146}]
[]
[]
[]
[]
[]
[]
[]
[null,"PRODUCTO: ATENCION ESTOMATOLOGICA RECUPERATIVA (5006276)"]
[null,"AVANCE  DE META FISICA A NIVEL DE PRODUCTO ",null,null," PERSONA TRATADA",{"$f":"+Q48+Q50+Q52+Q54+Q56+Q58","v":19583}]
[]
[null,"PpR","SUB PRODUCTO","CODICION","UNIDAD DE MEDIDA","CURSO DE VIDA \nNIÑO",null,null,null,null,null,null,"CURSO DE VIDA\n ADOLESCENTE","CURSO DE VIDA \nJOVEN","CURSO DE VIDA\n ADULTO ","CURSO DE VIDA\n ADULTO MAYOR","AVANCE  DE META FISICA A NIVEL DE SUB PRODUCTOS"]
[null,null,null,null,null,"0 - 28d","29d - 5m","6m - 11m","1 año ","2 años","3a - 5a","6a - 11a","12a - 17a","18a - 29a","30a - 59a","60 años a mas"]
[]
[1," 0068101","RASPAJE DENTAL\n","NO GESTANTE","CASO TRATADO",{"$f":"SUM(GETPIVOTDATA(\"Suma de B_DestartrajeN_CT_0_28d\",TD!$A$113))","v":0},{"$f":"SUM(GETPIVOTDATA(\"Suma de B_DestartrajeN_CT_29_5m\",TD!$A$113))","v":0},{"$f":"SUM(GETPIVOTDATA(\"Suma de B_DestartrajeN_CT_6_11m\",TD!$A$113))","v":0},{"$f":"SUM(GETPIVOTDATA(\"Suma de B_DestartrajeN_CT_1a\",TD!$A$113))","v":1},{"$f":"SUM(GETPIVOTDATA(\"Suma de B_DestartrajeN_CT_2a\",TD!$A$113))","v":1},{"$f":"SUM(GETPIVOTDATA(\"Suma de B_DestartrajeN_CT_3_5a\",TD!$A$113))","v":14},{"$f":"SUM(GETPIVOTDATA(\"Suma de B_DestartrajeN_CT_6_11a\",TD!$A$113))","v":27},{"$f":"SUM(GETPIVOTDATA(\"Suma de B_DestartrajeN_CT_Adolesc\",TD!$A$113))","v":184},{"$f":"SUM(GETPIVOTDATA(\"Suma de B_DestartrajeN_CT_Joven\",TD!$A$113))","v":279},{"$f":"SUM(GETPIVOTDATA(\"Suma de B_DestartrajeN_CT_Adulto\",TD!$A$113))","v":488},{"$f":"SUM(GETPIVOTDATA(\"Suma de B_DestartrajeN_CT_AdultoM\",TD!$A$113))","v":192},{"$f":"SUM(F48+G48+H48+I48+J48+K48+L48+M48+N48+O48+P48)","v":1186}]
[null,null,null," GESTANTE","CASO TRATADO",null,null,null,null,null,null,{"$f":"SUM(GETPIVOTDATA(\"Suma de B_DestartrajeN_CT_6_11a_g\",TD!$A$113))","v":0},{"$f":"SUM(GETPIVOTDATA(\"Suma de B_DestartrajeN_CT_Adol_g\",TD!$A$113))","v":20},{"$f":"SUM(GETPIVOTDATA(\"Suma de B_DestartrajeN_CT_Joven_g\",TD!$A$113))","v":224},{"$f":"SUM(GETPIVOTDATA(\"Suma de B_DestartrajeN_CT_Adulto_g\",TD!$A$113))","v":162}]
[2,"5000701","DEBRIDACIÓN DE LOS PROCESOS INFECCIOSOS BUCODENTALES","NO GESTANTE","CASO TRATADO",{"$f":"SUM(GETPIVOTDATA(\"Suma de B_Debridacion_BucodenN_0_28d\",TD!$A$113))","v":0},{"$f":"SUM(GETPIVOTDATA(\"Suma de B_Debridacion_BucodenN_29_5m\",TD!$A$113))","v":0},{"$f":"SUM(GETPIVOTDATA(\"Suma de B_Debridacion_BucodenN_6_11m\",TD!$A$113))","v":0},{"$f":"SUM(GETPIVOTDATA(\"Suma de B_Debridacion_BucodenN_1a\",TD!$A$113))","v":0},{"$f":"SUM(GETPIVOTDATA(\"Suma de B_Debridacion_BucodenN_2a\",TD!$A$113))","v":2},{"$f":"SUM(GETPIVOTDATA(\"Suma de B_Debridacion_BucodenN_3_5a\",TD!$A$113))","v":38},{"$f":"SUM(GETPIVOTDATA(\"Suma de B_Debridacion_BucodenN_6_11a\",TD!$A$113))","v":47},{"$f":"SUM(GETPIVOTDATA(\"Suma de B_Debridacion_BucodenN_Adolesc\",TD!$A$113))","v":49},{"$f":"SUM(GETPIVOTDATA(\"Suma de B_Debridacion_BucodenN_Joven\",TD!$A$113))","v":57},{"$f":"SUM(GETPIVOTDATA(\"Suma de B_Debridacion_BucodenN_Adulto\",TD!$A$113))","v":87},{"$f":"SUM(GETPIVOTDATA(\"Suma de B_Debridacion_BucodenN_AdultoM\",TD!$A$113))","v":12},{"$f":"SUM(F50+G50+H50+I50+J50+K50+L50+M50+N50+O50+P50+L51+M51+N51+O51)","v":296}]
[null,null,null," GESTANTE","CASO TRATADO",null,null,null,null,null,null,{"$f":"SUM(GETPIVOTDATA(\"Suma de B_Debridacion_BucodenN_6_11a_g\",TD!$A$113))","v":0},{"$f":"SUM(GETPIVOTDATA(\"Suma de B_Debridacion_BucodenN_Adol_g\",TD!$A$113))","v":0},{"$f":"SUM(GETPIVOTDATA(\"Suma de B_Debridacion_BucodenN_Joven_g\",TD!$A$113))","v":3},{"$f":"SUM(GETPIVOTDATA(\"Suma de B_Debridacion_BucodenN_Adulto_g\",TD!$A$113))","v":1}]
[3,"5000702","CONSULTA ESTOMATOLÓGICA","NO GESTANTE","CASO TRATADO",{"$f":"SUM(GETPIVOTDATA(\"Suma de B_Consulta_EstomatoN_0_28d\",TD!$A$113))","v":6},{"$f":"SUM(GETPIVOTDATA(\"Suma de B_Consulta_EstomatoN_29_5m\",TD!$A$113))","v":0},{"$f":"SUM(GETPIVOTDATA(\"Suma de B_Consulta_EstomatoN_6_11m\",TD!$A$113))","v":1},{"$f":"SUM(GETPIVOTDATA(\"Suma de B_Consulta_EstomatoN_1a\",TD!$A$113))","v":9},{"$f":"SUM(GETPIVOTDATA(\"Suma de B_Consulta_EstomatoN_2a\",TD!$A$113))","v":17},{"$f":"SUM(GETPIVOTDATA(\"Suma de B_Consulta_EstomatoN_3_5a\",TD!$A$113))","v":272},{"$f":"SUM(GETPIVOTDATA(\"Suma de B_Consulta_EstomatoN_6_11a\",TD!$A$113))","v":463},{"$f":"SUM(GETPIVOTDATA(\"Suma de B_Consulta_EstomatoN_Adolesc\",TD!$A$113))","v":360},{"$f":"SUM(GETPIVOTDATA(\"Suma de B_Consulta_EstomatoN_Joven\",TD!$A$113))","v":563},{"$f":"SUM(GETPIVOTDATA(\"Suma de B_Consulta_EstomatoN_Adulto\",TD!$A$113))","v":857},{"$f":"SUM(GETPIVOTDATA(\"Suma de B_Consulta_EstomatoN_AdultoM\",TD!$A$113))","v":356},{"$f":"SUM(F52+G52+H52+I52+J52+K52+L52+M52+N52+O52+P52+L53+M53+N53+O53)","v":3001}]
[null,null,null," GESTANTE","CASO TRATADO",null,null,null,null,null,null,{"$f":"SUM(GETPIVOTDATA(\"Suma de B_Consulta_EstomatoN_6_11a_g\",TD!$A$113))","v":0},{"$f":"SUM(GETPIVOTDATA(\"Suma de B_Consulta_EstomatoN_Adol_g\",TD!$A$113))","v":1},{"$f":"SUM(GETPIVOTDATA(\"Suma de B_Consulta_EstomatoN_Joven_g\",TD!$A$113))","v":49},{"$f":"SUM(GETPIVOTDATA(\"Suma de B_Consulta_EstomatoN_Adulto_g\",TD!$A$113))","v":47}]
[4,"5000703","EXODONCIA SIMPLE","NO GESTANTE","CASO TRATADO",{"$f":"SUM(GETPIVOTDATA(\"Suma de B_Exodoncia_SimpleN_I_0_28d\",TD!$A$113))","v":0},{"$f":"SUM(GETPIVOTDATA(\"Suma de B_Exodoncia_SimpleN_I_29_5m\",TD!$A$113))","v":0},{"$f":"SUM(GETPIVOTDATA(\"Suma de B_Exodoncia_SimpleN_I_6_11m\",TD!$A$113))","v":0},{"$f":"SUM(GETPIVOTDATA(\"Suma de B_Exodoncia_SimpleN_I_1a\",TD!$A$113))","v":0},{"$f":"SUM(GETPIVOTDATA(\"Suma de B_Exodoncia_SimpleN_I_2a\",TD!$A$113))","v":1},{"$f":"SUM(GETPIVOTDATA(\"Suma de B_Exodoncia_SimpleN_I_3_5a\",TD!$A$113))","v":96},{"$f":"SUM(GETPIVOTDATA(\"Suma de B_Exodoncia_SimpleN_I_6_11a\",TD!$A$113))","v":669},{"$f":"SUM(GETPIVOTDATA(\"Suma de B_Exodoncia_SimpleN_I_Adolesc\",TD!$A$113))","v":310},{"$f":"SUM(GETPIVOTDATA(\"Suma de B_Exodoncia_SimpleN_I_Joven\",TD!$A$113))","v":473},{"$f":"SUM(GETPIVOTDATA(\"Suma de B_Exodoncia_SimpleN_I_Adulto\",TD!$A$113))","v":901},{"$f":"SUM(GETPIVOTDATA(\"Suma de B_Exodoncia_SimpleN_I_AdultoM\",TD!$A$113))","v":503},{"$f":"SUM(F54+G54+H54+I54+J54+K54+L54+M54+N54+O54+P54+L55+M55+N55+O55)","v":3026}]
[null,null,null," GESTANTE","CASO TRATADO",null,null,null,null,null,null,{"$f":"SUM(GETPIVOTDATA(\"Suma de B_Exodoncia_SimpleN_I_6_11a_g\",TD!$A$113))","v":4},{"$f":"SUM(GETPIVOTDATA(\"Suma de B_Exodoncia_SimpleN_I_Adol_g\",TD!$A$113))","v":3},{"$f":"SUM(GETPIVOTDATA(\"Suma de B_Exodoncia_SimpleN_I_Joven_g\",TD!$A$113))","v":37},{"$f":"SUM(GETPIVOTDATA(\"Suma de B_Exodoncia_SimpleN_I_Adulto_g\",TD!$A$113))","v":29}]
[5,"5000704","RESTAURACIONES DENTALES CON IONÓMERO DE VIDRIO","NO GESTANTE","CASO TRATADO",null,null,{"$f":"SUM(GETPIVOTDATA(\"Suma de B_Ionomero_VidrioN_I_6_11m\",TD!$A$113))","v":0},{"$f":"SUM(GETPIVOTDATA(\"Suma de B_Ionomero_VidrioN_I_1a\",TD!$A$113))","v":1},{"$f":"SUM(GETPIVOTDATA(\"Suma de B_Ionomero_VidrioN_I_2a\",TD!$A$113))","v":25},{"$f":"SUM(GETPIVOTDATA(\"Suma de B_Ionomero_VidrioN_I_3_5a\",TD!$A$113))","v":832},{"$f":"SUM(GETPIVOTDATA(\"Suma de B_Ionomero_VidrioN_I_6_11a\",TD!$A$113))","v":594},{"$f":"SUM(GETPIVOTDATA(\"Suma de B_Ionomero_VidrioN_I_Adolesc\",TD!$A$113))","v":274},{"$f":"SUM(GETPIVOTDATA(\"Suma de B_Ionomero_VidrioN_I_Joven\",TD!$A$113))","v":120},{"$f":"SUM(GETPIVOTDATA(\"Suma de B_Ionomero_VidrioN_I_Adulto\",TD!$A$113))","v":169},{"$f":"SUM(GETPIVOTDATA(\"Suma de B_Ionomero_VidrioN_I_AdultoM\",TD!$A$113))","v":40},{"$f":"SUM(F56+G56+H56+I56+J56+K56+L56+M56+N56+O56+P56+L57+M57+N57+O57)","v":2131}]
[null,null,null," GESTANTE","CASO TRATADO",null,null,null,null,null,null,{"$f":"SUM(GETPIVOTDATA(\"Suma de B_Ionomero_VidrioN_I_6_11a_g\",TD!$A$113))","v":2},{"$f":"SUM(GETPIVOTDATA(\"Suma de B_Ionomero_VidrioN_I_Adol_g\",TD!$A$113))","v":4},{"$f":"SUM(GETPIVOTDATA(\"Suma de B_Ionomero_VidrioN_I_Joven_g\",TD!$A$113))","v":43},{"$f":"SUM(GETPIVOTDATA(\"Suma de B_Ionomero_VidrioN_I_Adulto_g\",TD!$A$113))","v":27}]
[6,"5000705","RESTAURACIÓN DENTAL CON RESINA","NO GESTANTE","CASO TRATADO",null,null,{"$f":"SUM(GETPIVOTDATA(\"Suma de B_ResinaN_I_6_11m\",TD!$A$113))","v":2},{"$f":"SUM(GETPIVOTDATA(\"Suma de B_ResinaN_I_1a\",TD!$A$113))","v":5},{"$f":"SUM(GETPIVOTDATA(\"Suma de B_ResinaN_I_2a\",TD!$A$113))","v":43},{"$f":"SUM(GETPIVOTDATA(\"Suma de B_ResinaN_I_3_5a\",TD!$A$113))","v":909},{"$f":"SUM(GETPIVOTDATA(\"Suma de B_ResinaN_I_6_11a\",TD!$A$113))","v":1640},{"$f":"SUM(GETPIVOTDATA(\"Suma de B_ResinaN_I_Adolesc\",TD!$A$113))","v":1841},{"$f":"SUM(GETPIVOTDATA(\"Suma de B_ResinaN_I_Joven\",TD!$A$113))","v":1885},{"$f":"SUM(GETPIVOTDATA(\"Suma de B_ResinaN_I_Adulto\",TD!$A$113))","v":2082},{"$f":"SUM(GETPIVOTDATA(\"Suma de B_ResinaN_I_AdultoM\",TD!$A$113))","v":389},{"$f":"SUM(H58+I58+J58+K58+L58+M58+N58+O58+P58+L59+M59+N59+O59)","v":9943}]
[null,null,null," GESTANTE","CASO TRATADO",null,null,null,null,null,null,{"$f":"SUM(GETPIVOTDATA(\"Suma de B_ResinaN_I_6_11a_g\",TD!$A$113))","v":12},{"$f":"SUM(GETPIVOTDATA(\"Suma de B_ResinaN_I_Adol_g\",TD!$A$113))","v":95},{"$f":"SUM(GETPIVOTDATA(\"Suma de B_ResinaN_I_Joven_g\",TD!$A$113))","v":625},{"$f":"SUM(GETPIVOTDATA(\"Suma de B_ResinaN_I_Adulto_g\",TD!$A$113))","v":415}]
[]
[]
[null,null,"PRODUCTO: ATENCION ESTOMATOLOGICA ESPECIALIZADA (3000682)"]
[null,null,"AVANCE  DE META FISICA A NIVEL DE PRODUCTO ",null," PERSONA TRATADA",{"$f":"+Q68+Q70+Q74+Q76+Q78","v":831}]
[]
[null,"PpR","SUB PRODUCTO","CODICI,N","UNIDAD DE MEDIDA","CURSO DE VIDA \nNIÑO",null,null,null,null,null,null,"CURSO DE VIDA\n ADOLESCENTE","CURSO DE VIDA \nJOVEN","CURSO DE VIDA\n ADULTO ","CURSO DE VIDA\n ADULTO MAYOR","AVANCE  DE META FISICA A NIVEL DE SUB PRODUCTOS"]
[null,null,null,null,null,"0 - 28d","29d - 5m","6m - 11m","1 año ","2 años","3a - 5a","6a - 11a","12a - 17a","18a - 29a","30a - 59a","60 años a mas"]
[]
[1,"5000814","TERAPIA PULPAR","NO GESTANTE","CASO TRATADO",null,null,{"$f":"SUM(GETPIVOTDATA(\"Suma de B_PulpotomiaN_I_6_11m\",TD!$A$113))","v":0},{"$f":"SUM(GETPIVOTDATA(\"Suma de B_PulpotomiaN_I_1a\",TD!$A$113))","v":0},{"$f":"SUM(GETPIVOTDATA(\"Suma de B_PulpotomiaN_I_2a\",TD!$A$113))","v":2},{"$f":"SUM(GETPIVOTDATA(\"Suma de B_PulpotomiaN_I_3_5a\",TD!$A$113))","v":46},{"$f":"SUM(GETPIVOTDATA(\"Suma de B_PulpotomiaN_I_6_11a\",TD!$A$113))","v":119},{"$f":"SUM(GETPIVOTDATA(\"Suma de B_PulpotomiaN_I_Adolesc\",TD!$A$113))","v":166},{"$f":"SUM(GETPIVOTDATA(\"Suma de B_PulpotomiaN_I_Joven\",TD!$A$113))","v":129},{"$f":"SUM(GETPIVOTDATA(\"Suma de B_PulpotomiaN_I_Adulto\",TD!$A$113))","v":157},{"$f":"SUM(GETPIVOTDATA(\"Suma de B_PulpotomiaN_I_AdultoM\",TD!$A$113))","v":32},{"$f":"SUM(H68+I68+J68+K68+L68+M68+N68+O68+P68+L69+M69+N69+O69)","v":708}]
[null,null,null," GESTANTE","CASO TRATADO",null,null,null,null,null,null,{"$f":"SUM(GETPIVOTDATA(\"Suma de B_PulpotomiaN_I_6_11a_g\",TD!$A$113))","v":12},{"$f":"SUM(GETPIVOTDATA(\"Suma de B_PulpotomiaN_I_Adol_g\",TD!$A$113))","v":3},{"$f":"SUM(GETPIVOTDATA(\"Suma de B_PulpotomiaN_I_Joven_g\",TD!$A$113))","v":20},{"$f":"SUM(GETPIVOTDATA(\"Suma de B_PulpotomiaN_I_Adulto_g\",TD!$A$113))","v":22}]
[2,"5000815","TERAPIA ENDODÓNTICA","NO GESTANTE","CASO TRATADO",null,null,{"$f":"SUM(GETPIVOTDATA(\"Suma de B_TEndodonticaN_TA_6_11m\",TD!$A$113))","v":0},{"$f":"SUM(GETPIVOTDATA(\"Suma de B_TEndodonticaN_TA_1a\",TD!$A$113))","v":0},{"$f":"SUM(GETPIVOTDATA(\"Suma de B_TEndodonticaN_TA_2a\",TD!$A$113))","v":2},{"$f":"SUM(GETPIVOTDATA(\"Suma de B_TEndodonticaN_TA_3_5a\",TD!$A$113))","v":52},{"$f":"SUM(GETPIVOTDATA(\"Suma de B_TEndodonticaN_TA_6_11a\",TD!$A$113))","v":7},{"$f":"SUM(GETPIVOTDATA(\"Suma de B_TEndodonticaN_TA_Adolesc\",TD!$A$113))","v":5},{"$f":"SUM(GETPIVOTDATA(\"Suma de B_TEndodonticaN_TA_Joven\",TD!$A$113))","v":3},{"$f":"SUM(GETPIVOTDATA(\"Suma de B_TEndodonticaN_TA_Adulto\",TD!$A$113))","v":1},{"$f":"SUM(GETPIVOTDATA(\"Suma de B_TEndodonticaN_TA_AdultoM\",TD!$A$113))","v":0},{"$f":"SUM(H70+I70+J70+K70+L70+M70+N70+O70+P70+L71+M71+N71+O71)","v":71}]
[null,null,null," GESTANTE","CASO TRATADO",null,null,null,null,null,null,{"$f":"SUM(GETPIVOTDATA(\"Suma de B_TEndodonticaN_TA_6_11a_g\",TD!$A$113))","v":0},{"$f":"SUM(GETPIVOTDATA(\"Suma de B_TEndodonticaN_TA_Adol_g\",TD!$A$113))","v":0},{"$f":"SUM(GETPIVOTDATA(\"Suma de B_TEndodonticaN_TA_Joven_g\",TD!$A$113))","v":0},{"$f":"SUM(GETPIVOTDATA(\"Suma de B_TEndodonticaN_TA_Adulto_g\",TD!$A$113))","v":1}]
[3,"500818","TRATAMIENTO DE ORTODONCIA Y ORTOPEDIA MAXILAR","NO GESTANTE","CASO TRATADO",null,null,{"$f":"SUM(GETPIVOTDATA(\"Suma de B_OrtopediaMaxilarN_in_6_11m\",TD!$A$113))","v":0},{"$f":"SUM(GETPIVOTDATA(\"Suma de B_OrtopediaMaxilarN_in_1a\",TD!$A$113))","v":0},{"$f":"SUM(GETPIVOTDATA(\"Suma de B_OrtopediaMaxilarN_in_2a\",TD!$A$113))","v":0},{"$f":"SUM(GETPIVOTDATA(\"Suma de B_OrtopediaMaxilarN_in_3_5a\",TD!$A$113))","v":0},{"$f":"SUM(GETPIVOTDATA(\"Suma de B_OrtopediaMaxilarN_in_6_11a\",TD!$A$113))","v":0},{"$f":"SUM(GETPIVOTDATA(\"Suma de B_OrtopediaMaxilarN_in_Adolesc\",TD!$A$113))","v":0},{"$f":"SUM(GETPIVOTDATA(\"Suma de B_OrtopediaMaxilarN_in_Joven\",TD!$A$113))","v":0},{"$f":"SUM(GETPIVOTDATA(\"Suma de B_OrtopediaMaxilarN_in_Adulto\",TD!$A$113))","v":0},{"$f":"SUM(GETPIVOTDATA(\"Suma de B_OrtopediaMaxilarN_in_AdultoM\",TD!$A$113))","v":0},{"$f":"SUM(H72+I72+J72+K72+L72+M72+N72+O72+P72+L73+M73+N73+O73)","v":0}]
[null,null,null," GESTANTE","CASO TRATADO",null,null,null,null,null,null,{"$f":"SUM(GETPIVOTDATA(\"Suma de B_OrtopediaMaxilarN_in_6_11a_g\",TD!$A$113))","v":0},{"$f":"SUM(GETPIVOTDATA(\"Suma de B_OrtopediaMaxilarN_in_Adol_g\",TD!$A$113))","v":0},{"$f":"SUM(GETPIVOTDATA(\"Suma de B_OrtopediaMaxilarN_in_Joven_g\",TD!$A$113))","v":0},{"$f":"SUM(GETPIVOTDATA(\"Suma de B_OrtopediaMaxilarN_in_Adulto_g\",TD!$A$113))","v":0}]
[4,"5000804","REHABILITACIÓN PROTÉSICA","NO GESTANTE","CASO TRATADO",null,null,null,null,null,{"$f":"SUM(GETPIVOTDATA(\"Suma de B_RehabProtesicaN_in_3_5a\",TD!$A$113))","v":0},{"$f":"SUM(GETPIVOTDATA(\"Suma de B_RehabProtesicaN_in_6_11a\",TD!$A$113))","v":0},{"$f":"SUM(GETPIVOTDATA(\"Suma de B_RehabProtesicaN_in_Adolesc\",TD!$A$113))","v":0},{"$f":"SUM(GETPIVOTDATA(\"Suma de B_RehabProtesicaN_in_Joven\",TD!$A$113))","v":0},{"$f":"SUM(GETPIVOTDATA(\"Suma de B_RehabProtesicaN_in_Adulto\",TD!$A$113))","v":0},{"$f":"SUM(GETPIVOTDATA(\"Suma de B_RehabProtesicaN_in_AdultoM\",TD!$A$113))","v":0},{"$f":"SUM(K74+L74+M74+N74+O74+P74+L75+M75+N75+O75)","v":0}]
[null,null,null," GESTANTE","CASO TRATADO",null,null,null,null,null,null,{"$f":"SUM(GETPIVOTDATA(\"Suma de B_RehabProtesicaN_in_6_11a_g\",TD!$A$113))","v":0},{"$f":"SUM(GETPIVOTDATA(\"Suma de B_RehabProtesicaN_in_Adol_g\",TD!$A$113))","v":0},{"$f":"SUM(GETPIVOTDATA(\"Suma de B_RehabProtesicaN_in_Joven_g\",TD!$A$113))","v":0},{"$f":"SUM(GETPIVOTDATA(\"Suma de B_RehabProtesicaN_in_Adulto_g\",TD!$A$113))","v":0}]
[5,"5000816","SUB PRODUCTO: TRATAMIENTO PERIODONTAL","NO GESTANTE","CASO TRATADO",null,null,null,null,null,{"$f":"SUM(GETPIVOTDATA(\"Suma de B_TtoPeriodontalN_3_5a\",TD!$A$113))","v":1},{"$f":"SUM(GETPIVOTDATA(\"Suma de B_TtoPeriodontalN_6_11a\",TD!$A$113))","v":3},{"$f":"SUM(GETPIVOTDATA(\"Suma de B_TtoPeriodontalN_Adolesc\",TD!$A$113))","v":1},{"$f":"SUM(GETPIVOTDATA(\"Suma de B_TtoPeriodontalN_Joven\",TD!$A$113))","v":0},{"$f":"SUM(GETPIVOTDATA(\"Suma de B_TtoPeriodontalN_Adulto\",TD!$A$113))","v":4},{"$f":"SUM(GETPIVOTDATA(\"Suma de B_TtoPeriodontalN_AdultoM\",TD!$A$113))","v":0},{"$f":"SUM(K76+L76+M76+N76+O76+P76+L77+M77+N77+O77)","v":16}]
[null,null,null," GESTANTE","CASO TRATADO",null,null,null,null,null,null,{"$f":"SUM(GETPIVOTDATA(\"Suma de B_TtoPeriodontalN_6_11a_g\",TD!$A$113))","v":0},{"$f":"SUM(GETPIVOTDATA(\"Suma de B_TtoPeriodontalN_Adol_g\",TD!$A$113))","v":0},{"$f":"SUM(GETPIVOTDATA(\"Suma de B_TtoPeriodontalN_Joven_g\",TD!$A$113))","v":0},{"$f":"SUM(GETPIVOTDATA(\"Suma de B_TtoPeriodontalN_Adulto_g\",TD!$A$113))","v":7}]
[6,"5000817","TRATAMIENTO QUIRÚRGICO BUCAL Y MÁXILO FACIAL","NO GESTANTE","CASO TRATADO",{"$f":"SUM(GETPIVOTDATA(\"Suma de B_MaxiloFacialN_I_0_28d\",TD!$A$113))","v":0},{"$f":"SUM(GETPIVOTDATA(\"Suma de B_MaxiloFacialN_I_29_5m\",TD!$A$113))","v":0},{"$f":"SUM(GETPIVOTDATA(\"Suma de B_MaxiloFacialN_I_6_11m\",TD!$A$113))","v":0},{"$f":"SUM(GETPIVOTDATA(\"Suma de B_MaxiloFacialN_I_1a\",TD!$A$113))","v":0},{"$f":"SUM(GETPIVOTDATA(\"Suma de B_MaxiloFacialN_I_2a\",TD!$A$113))","v":0},{"$f":"SUM(GETPIVOTDATA(\"Suma de B_MaxiloFacialN_3_5a\",TD!$A$113))","v":0},{"$f":"SUM(GETPIVOTDATA(\"Suma de B_MaxiloFacialN_6_11a\",TD!$A$113))","v":2},{"$f":"SUM(GETPIVOTDATA(\"Suma de B_MaxiloFacialN_Adolesc\",TD!$A$113))","v":1},{"$f":"SUM(GETPIVOTDATA(\"Suma de B_MaxiloFacialN_Joven\",TD!$A$113))","v":20},{"$f":"SUM(GETPIVOTDATA(\"Suma de B_MaxiloFacialN_Adulto\",TD!$A$113))","v":7},{"$f":"SUM(GETPIVOTDATA(\"Suma de B_MaxiloFacialN_AdultoM\",TD!$A$113))","v":6},{"$f":"SUM(F78+G78+H78+I78+J78+K78+L78+M78+N78+O78+P78+L79+M79+N79+O79)","v":36}]
[null,null,null," GESTANTE","CASO TRATADO",null,null,null,null,null,null,{"$f":"SUM(GETPIVOTDATA(\"Suma de B_MaxiloFacialN_6_11a_g\",TD!$A$113))","v":0},{"$f":"SUM(GETPIVOTDATA(\"Suma de B_MaxiloFacialN_Adol_g\",TD!$A$113))","v":0},{"$f":"SUM(GETPIVOTDATA(\"Suma de B_MaxiloFacialN_Joven_g\",TD!$A$113))","v":0},{"$f":"SUM(GETPIVOTDATA(\"Suma de B_MaxiloFacialN_Adulto_g\",TD!$A$113))","v":0}]

{"sheet":"Avance_Meta_Fisica_SinPob_Asig","index":5,"n_rows":79,"n_cols":17,"rows_kept":79,"cut":false,"hidden":false,"merged":[[0,0,0,17],[1,0,1,17],[2,0,2,16],[3,0,3,17],[4,0,4,17],[6,3,6,6],[6,10,6,13],[17,1,18,1],[17,2,18,2],[17,3,18,3],[17,4,18,4],[17,5,17,11],[17,16,18,16],[8,3,8,6],[8,10,8,13],[10,3,10,6],[10,10,10,13],[13,1,13,5],[15,1,15,3],[15,5,15,6],[24,0,25,0],[24,1,25,1],[24,2,25,2],[24,16,25,16],[26,0,27,0],[26,1,27,1],[26,2,27,2],[26,16,27,16],[20,0,21,0],[20,1,21,1],[20,2,21,2],[20,16,21,16],[22,0,23,0],[22,1,23,1],[22,2,23,2],[22,16,23,16],[32,16,33,16],[35,2,35,5],[41,1,41,5],[28,0,29,0],[28,1,29,1],[28,2,29,2],[28,16,29,16],[30,0,31,0],[30,1,31,1],[30,2,31,2],[30,16,31,16],[42,1,42,3],[42,5,42,6],[44,1,45,1],[44,2,45,2],[44,3,45,3],[44,4,45,4],[44,5,44,11],[32,0,33,0],[32,1,33,1],[32,2,33,2],[44,16,45,16],[47,0,48,0],[47,1,48,1],[47,2,48,2],[47,16,48,16],[49,0,50,0],[49,1,50,1],[49,2,50,2],[49,16,50,16],[55,16,56,16],[57,0,58,0],[57,1,58,1],[57,2,58,2],[57,16,58,16],[51,0,52,0],[51,1,52,1],[51,2,52,2],[51,16,52,16],[53,0,54,0],[53,1,54,1],[53,2,54,2],[53,16,54,16],[61,2,61,5],[62,2,62,3],[62,5,62,6],[64,1,65,1],[64,2,65,2],[64,3,65,3],[64,4,65,4],[64,5,64,11],[55,0,56,0],[55,1,56,1],[55,2,56,2],[64,16,65,16],[67,0,68,0],[67,1,68,1],[67,2,68,2],[67,16,68,16],[69,0,70,0],[69,1,70,1],[69,2,70,2],[69,16,70,16],[75,0,76,0],[75,1,76,1],[75,2,76,2],[75,16,76,16],[77,0,78,0],[77,1,78,1],[77,2,78,2],[77,16,78,16],[71,0,72,0],[71,1,72,1],[71,2,72,2],[71,16,72,16],[73,0,74,0],[73,1,74,1],[73,2,74,2],[73,16,74,16]]}
["GERENCIA REGIONAL DE SALUD CUSCO"]
["DIRECCION EJECUTIVA DE INTELIGENCIA SANITARIA"]
["DIRECCION DE ESTADISTICA INFORMATICA Y TELECOMUNICACIONES"]
["SALUD BUCAL"]
["INFORME DE AVANCES DE METAS FISICAS SIS - SIN POBLACION ASIGNADA"]
[]
[null,null,"RED DE SALUD",{"$f":"TD!F3","v":"LA CONVENCION"},null,null,null,null,"PROVINCIA",null,{"$f":"TD!F6","v":"(All)"},null,null,null,null,"AÑO :",{"$f":"TD!C10","v":"2024"}]
[]
[null,null,"MICRO RED",{"$f":"TD!F4","v":"(All)"},null,null,null,null,"DISTRITO",null,{"$f":"TD!F7","v":"(All)"},null,null,null,null,"MES :",{"$f":"TD!O17","v":"ENERO - NOVIEMBRE"}]
[]
[null,null,"ESTABLECIMIENTO",{"$f":"TD!F5","v":"(All)"},null,null,null,null,"U.E.",null,{"$f":"TD!F8","v":"(All)"}]
[]
[]
[null,"PRODUCTO: ATENCIÓN ESTOMATOLOGICA PREVENTIVA (3000680)"]
[]
[null,"AVANCE  DE META FISICA A NIVEL DE PRODUCTO ",null,null," PERSONA ATENDIDA",{"$f":"+Q21+Q23+Q25+Q27+Q29+Q31+Q33","v":0}]
[]
[null,"PpR","SUB PRODUCTO","CODICION","UNIDAD DE MEDIDA","CURSO DE VIDA \nNIÑO",null,null,null,null,null,null,"CURSO DE VIDA\n ADOLESCENTE","CURSO DE VIDA \nJOVEN","CURSO DE VIDA\n ADULTO ","CURSO DE VIDA\n ADULTO MAYOR","AVANCE  DE META FISICA A NIVEL DE SUB PRODUCTOS"]
[null,null,null,null,null,"0 - 28d","29d - 5m","6m - 11m","1 año ","2 años","3a - 5a","6a - 11a","12a - 17a","18a - 29a","30a - 59a","60 años a mas"]
[]
[1,"0068001","ASESORÍA NUTRICIONAL PARA EL CONTROL DE ENFERMEDADES DENTALES","NO GESTANTE","PERSONA ATENDIDA",{"$f":"SUM(GETPIVOTDATA(\" B_ANCEDNs_CT_0_28d\",TD!$A$140))","v":0},{"$f":"SUM(GETPIVOTDATA(\" B_ANCEDNs_CT_29_5m\",TD!$A$140))","v":0},{"$f":"SUM(GETPIVOTDATA(\" B_ANCEDNs_CT_6_11m\",TD!$A$140))","v":0},{"$f":"SUM(GETPIVOTDATA(\" B_ANCEDNs_CT_1a\",TD!$A$140))","v":0},{"$f":"SUM(GETPIVOTDATA(\" B_ANCEDNs_CT_2a\",TD!$A$140))","v":0},{"$f":"SUM(GETPIVOTDATA(\" B_ANCEDNs_CT_3_5a\",TD!$A$140))","v":0},{"$f":"SUM(GETPIVOTDATA(\" B_ANCEDNs_CT_6_11a\",TD!$A$140))","v":0},{"$f":"SUM(GETPIVOTDATA(\" B_ANCEDNs_CT_Adolesc\",TD!$A$140))","v":0},{"$f":"SUM(GETPIVOTDATA(\" B_ANCEDNs_CT_Joven\",TD!$A$140))","v":0},{"$f":"SUM(GETPIVOTDATA(\" B_ANCEDNs_CT_Adulto\",TD!$A$140))","v":0},{"$f":"SUM(GETPIVOTDATA(\" B_ANCEDNs_CT_AdultoM\",TD!$A$140))","v":0},{"$f":"SUM(F21+G21+H21+I21+J21+K21+L21+M21+N21+O21+P21)","v":0}]
[null,null,null," GESTANTE","PERSONA ATENDIDA",null,null,null,null,null,null,".",{"$f":"SUM(GETPIVOTDATA(\" B_ANCEDNs_CT_Adol_g\",TD!$A$140))","v":0},{"$f":"SUM(GETPIVOTDATA(\" B_ANCEDNs_CT_Joven_g\",TD!$A$140))","v":0},{"$f":"SUM(GETPIVOTDATA(\" B_ANCEDNs_CT_Adulto_g\",TD!$A$140))","v":0}]
[2,"0068002","EXAMEN ESTOMATOLÓGICO","NO GESTANTE","PERSONA ATENDIDA",{"$f":"SUM(GETPIVOTDATA(\" B_EXODONNs_CT_0_28d\",TD!$A$140))","v":0},{"$f":"SUM(GETPIVOTDATA(\" B_EXODONNs_CT_29_5m\",TD!$A$140))","v":0},{"$f":"SUM(GETPIVOTDATA(\" B_EXODONNs_CT_6_11m\",TD!$A$140))","v":0},{"$f":"SUM(GETPIVOTDATA(\" B_EXODONNs_CT_1a\",TD!$A$140))","v":0},{"$f":"SUM(GETPIVOTDATA(\" B_EXODONNs_CT_2a\",TD!$A$140))","v":0},{"$f":"SUM(GETPIVOTDATA(\" B_EXODONNs_CT_3_5a\",TD!$A$140))","v":0},{"$f":"SUM(GETPIVOTDATA(\" B_EXODONNs_CT_6_11a\",TD!$A$140))","v":0},{"$f":"SUM(GETPIVOTDATA(\" B_EXODONNs_CT_Adolesc\",TD!$A$140))","v":0},{"$f":"SUM(GETPIVOTDATA(\" B_EXODONNs_CT_Joven\",TD!$A$140))","v":0},{"$f":"SUM(GETPIVOTDATA(\" B_EXODONNs_CT_Adulto\",TD!$A$140))","v":0},{"$f":"SUM(GETPIVOTDATA(\" B_EXODONNs_CT_AdultoM\",TD!$A$140))","v":0},{"$f":"SUM(F23+G23+H23+I23+J23+K23+L23+M23+N23+O23+P23)","v":0}]
[null,null,null," GESTANTE","PERSONA ATENDIDA",null,null,null,null,null,null,{"$f":"SUM(GETPIVOTDATA(\" B_EXODONNs_CT_6_11a_g\",TD!$A$140))","v":0},{"$f":"SUM(GETPIVOTDATA(\" B_EXODONNs_CT_Adol_g\",TD!$A$140))","v":0},{"$f":"SUM(GETPIVOTDATA(\" B_EXODONNs_CT_Joven_g\",TD!$A$140))","v":0},{"$f":"SUM(GETPIVOTDATA(\" B_EXODONNs_CT_Adulto_g\",TD!$A$140))","v":0}]
[3,"0068003","INSTRUCCIÓN DE HIGIENE ORAL","NO GESTANTE","PERSONA ATENDIDA",null,null,{"$f":"SUM(GETPIVOTDATA(\" B_IHONs_CT_6_11m\",TD!$A$140))","v":0},{"$f":"SUM(GETPIVOTDATA(\" B_IHONs_CT_1a\",TD!$A$140))","v":0},{"$f":"SUM(GETPIVOTDATA(\" B_IHONs_CT_2a\",TD!$A$140))","v":0},{"$f":"SUM(GETPIVOTDATA(\" B_IHONs_CT_3_5a\",TD!$A$140))","v":0},{"$f":"SUM(GETPIVOTDATA(\" B_IHONs_CT_6_11a\",TD!$A$140))","v":0},{"$f":"SUM(GETPIVOTDATA(\" B_IHONs_CT_Adolesc\",TD!$A$140))","v":0},{"$f":"SUM(GETPIVOTDATA(\" B_IHONs_CT_Joven\",TD!$A$140))","v":0},{"$f":"SUM(GETPIVOTDATA(\" B_IHONs_CT_Adulto\",TD!$A$140))","v":0},{"$f":"SUM(GETPIVOTDATA(\" B_IHONs_CT_AdultoM\",TD!$A$140))","v":0},{"$f":"SUM(H25+I25+J25+K25+L25+M25+N25+O25+P25)","v":0}]
[null,null,null," GESTANTE","PERSONA ATENDIDA",null,null,null,null,null,null,{"$f":"SUM(GETPIVOTDATA(\" B_IHONs_CT_6_11a_g\",TD!$A$140))","v":0},{"$f":"SUM(GETPIVOTDATA(\" B_IHONs_CT_Adol_g\",TD!$A$140))","v":0},{"$f":"SUM(GETPIVOTDATA(\" B_IHONs_CT_Joven_g\",TD!$A$140))","v":0},{"$f":"SUM(GETPIVOTDATA(\" B_IHONs_CT_Adulto_g\",TD!$A$140))","v":0}]
[4,"5000601","APLICACIÓN DE SELLANTES ","NO GESTANTE","PERSONA ATENDIDA",null,null,null,null,{"$f":"SUM(GETPIVOTDATA(\" B_ASELNs_CT_2a\",TD!$A$140))","v":0},{"$f":"SUM(GETPIVOTDATA(\" B_ASELNs_CT_3_5a\",TD!$A$140))","v":0},{"$f":"SUM(GETPIVOTDATA(\" B_ASELNs_CT_6_11a\",TD!$A$140))","v":0},{"$f":"SUM(GETPIVOTDATA(\" B_ASELNs_CT_Adolesc\",TD!$A$140))","v":0},{"$f":"SUM(GETPIVOTDATA(\" B_ASELNs_CT_Joven\",TD!$A$140))","v":0},{"$f":"SUM(GETPIVOTDATA(\" B_ASELNs_CT_Adulto\",TD!$A$140))","v":0},{"$f":"SUM(GETPIVOTDATA(\" B_ASELNs_CT_AdultoM\",TD!$A$140))","v":0},{"$f":"SUM(J27+K27+L27)","v":0}]
[null,null,null," GESTANTE","PERSONA ATENDIDA",null,null,null,null,null,null,{"$f":"SUM(GETPIVOTDATA(\" B_ASELNs_CT_6_11a_g\",TD!$A$140))","v":0},{"$f":"SUM(GETPIVOTDATA(\" B_ASELNs_CT_Adol_g\",TD!$A$140))","v":0},{"$f":"SUM(GETPIVOTDATA(\" B_ASELNs_CT_Joven_g\",TD!$A$140))","v":0},{"$f":"SUM(GETPIVOTDATA(\" B_ASELNs_CT_Adulto_g\",TD!$A$140))","v":0}]
[5,"5000602","APLICACIÓN DE FLÚOR BARNIZ","NO GESTANTE","PERSONA ATENDIDA",null,null,{"$f":"SUM(GETPIVOTDATA(\" B_ABFNs_CT_6_11m\",TD!$A$140))","v":0},{"$f":"SUM(GETPIVOTDATA(\" B_ABFNs_CT_1a\",TD!$A$140))","v":0},{"$f":"SUM(GETPIVOTDATA(\" B_ABFNs_CT_2a\",TD!$A$140))","v":0},{"$f":"SUM(GETPIVOTDATA(\" B_ABFNs_CT_3_5a\",TD!$A$140))","v":0},{"$f":"SUM(GETPIVOTDATA(\" B_ABFNs_CT_6_11a\",TD!$A$140))","v":0},{"$f":"SUM(GETPIVOTDATA(\" B_ABFNs_CT_Adolesc\",TD!$A$140))","v":0},{"$f":"SUM(GETPIVOTDATA(\" B_ABFNs_CT_Joven\",TD!$A$140))","v":0},{"$f":"SUM(GETPIVOTDATA(\" B_ABFNs_CT_Adulto\",TD!$A$140))","v":0},{"$f":"SUM(GETPIVOTDATA(\" B_ABFNs_CT_AdultoM\",TD!$A$140))","v":0},{"$f":"SUM(H29+I29+J29+K29+L29+M29+N29)","v":0}]
[null,null,null," GESTANTE","PERSONA ATENDIDA",null,null,null,null,null,null,{"$f":"SUM(GETPIVOTDATA(\" B_ABFNs_CT_6_11a_g\",TD!$A$140))","v":0},{"$f":"SUM(GETPIVOTDATA(\" B_ABFNs_CT_Adol_g\",TD!$A$140))","v":0},{"$f":"SUM(GETPIVOTDATA(\" B_ABFNs_CT_Joven_g\",TD!$A$140))","v":0},{"$f":"SUM(GETPIVOTDATA(\" B_ABFNs_CT_Adulto_g\",TD!$A$140))","v":0}]
[6,"5000603","APLICACIÓN DE FLÚOR GEL","NO GESTANTE","PERSONA ATENDIDA",null,null,null,null,null,null,null,null,null,{"$f":"SUM(GETPIVOTDATA(\" B_AFGNs_CT_Adulto\",TD!$A$140))","v":0},{"$f":"SUM(GETPIVOTDATA(\" B_AFGNs_CT_AdultoM\",TD!$A$140))","v":0},{"$f":"SUM(O31+P31+O32)","v":0}]
[null,null,null," GESTANTE","PERSONA ATENDIDA",null,null,null,null,null,null,{"$f":"SUM(GETPIVOTDATA(\" B_AFGNs_CT_6_11a_g\",TD!$A$140))","v":0},{"$f":"SUM(GETPIVOTDATA(\" B_AFGNs_CT_Adol_g\",TD!$A$140))","v":0},{"$f":"SUM(GETPIVOTDATA(\" B_AFGNs_CT_Joven_g\",TD!$A$140))","v":0},{"$f":"SUM(GETPIVOTDATA(\" B_AFGNs_CT_Adulto_g\",TD!$A$140))","v":0}]
[7,"5000606","PROFILAXIS DENTAL","NO GESTANTE","PERSONA ATENDIDA",null,null,{"$f":"SUM(GETPIVOTDATA(\" B_PDNs_CT_6_11m\",TD!$A$140))","v":0},{"$f":"SUM(GETPIVOTDATA(\" B_PDNs_CT_1a\",TD!$A$140))","v":0},{"$f":"SUM(GETPIVOTDATA(\" B_PDNs_CT_2a\",TD!$A$140))","v":0},{"$f":"SUM(GETPIVOTDATA(\" B_PDNs_CT_3_5a\",TD!$A$140))","v":0},{"$f":"SUM(GETPIVOTDATA(\" B_PDNs_CT_6_11a\",TD!$A$140))","v":0},{"$f":"SUM(GETPIVOTDATA(\" B_PDNs_CT_Adolesc\",TD!$A$140))","v":0},{"$f":"SUM(GETPIVOTDATA(\" B_PDNs_CT_Joven\",TD!$A$140))","v":0},{"$f":"SUM(GETPIVOTDATA(\" B_PDNs_CT_Adulto\",TD!$A$140))","v":0},{"$f":"SUM(GETPIVOTDATA(\" B_PDNs_CT_AdultoM\",TD!$A$140))","v":0},{"$f":"SUM(H33+I33+J33+K33+L33+M33+N33+O33+P33)","v":0}]
[null,null,null," GESTANTE","PERSONA ATENDIDA",null,null,null,null,null,null,{"$f":"SUM(GETPIVOTDATA(\" B_PDNs_CT_6_11a_g\",TD!$A$140))","v":0},{"$f":"SUM(GETPIVOTDATA(\" B_PDNs_CT_Adol_g\",TD!$A$140))","v":0},{"$f":"SUM(GETPIVOTDATA(\" B_PDNs_CT_Joven_g\",TD!$A$140))","v":0},{"$f":"SUM(GETPIVOTDATA(\" B_PDNs_CT_Adulto_g\",TD!$A$140))","v":0}]
[]
[]
[]
[]
[]
[]
[]
[null,"PRODUCTO: ATENCION ESTOMATOLOGICA RECUPERATIVA (5006276)"]
[null,"AVANCE  DE META FISICA A NIVEL DE PRODUCTO ",null,null," PERSONA TRATADA",{"$f":"+Q48+Q50+Q52+Q54+Q56+Q58","v":0}]
[]
[null,"PpR","SUB PRODUCTO","CODICION","UNIDAD DE MEDIDA","CURSO DE VIDA \nNIÑO",null,null,null,null,null,null,"CURSO DE VIDA\n ADOLESCENTE","CURSO DE VIDA \nJOVEN","CURSO DE VIDA\n ADULTO ","CURSO DE VIDA\n ADULTO MAYOR","AVANCE  DE META FISICA A NIVEL DE SUB PRODUCTOS"]
[null,null,null,null,null,"0 - 28d","29d - 5m","6m - 11m","1 año ","2 años","3a - 5a","6a - 11a","12a - 17a","18a - 29a","30a - 59a","60 años a mas"]
[]
[1," 0068101","RASPAJE DENTAL\n","NO GESTANTE","CASO TRATADO",{"$f":"SUM(GETPIVOTDATA(\" B_DestartrajeNs_CT_0_28d\",TD!$A$140))","v":0},{"$f":"SUM(GETPIVOTDATA(\" B_DestartrajeNs_CT_29_5m\",TD!$A$140))","v":0},{"$f":"SUM(GETPIVOTDATA(\" B_DestartrajeNs_CT_6_11m\",TD!$A$140))","v":0},{"$f":"SUM(GETPIVOTDATA(\" B_DestartrajeNs_CT_1a\",TD!$A$140))","v":0},{"$f":"SUM(GETPIVOTDATA(\" B_DestartrajeNs_CT_2a\",TD!$A$140))","v":0},{"$f":"SUM(GETPIVOTDATA(\" B_DestartrajeNs_CT_3_5a\",TD!$A$140))","v":0},{"$f":"SUM(GETPIVOTDATA(\" B_DestartrajeNs_CT_6_11a\",TD!$A$140))","v":0},{"$f":"SUM(GETPIVOTDATA(\" B_DestartrajeNs_CT_Adolesc\",TD!$A$140))","v":0},{"$f":"SUM(GETPIVOTDATA(\" B_DestartrajeNs_CT_Joven\",TD!$A$140))","v":0},{"$f":"SUM(GETPIVOTDATA(\" B_DestartrajeNs_CT_Adulto\",TD!$A$140))","v":0},{"$f":"SUM(GETPIVOTDATA(\" B_DestartrajeNs_CT_AdultoM\",TD!$A$140))","v":0},{"$f":"SUM(F48+G48+H48+I48+J48+K48+L48+M48+N48+O48+P48)","v":0}]
[null,null,null," GESTANTE","CASO TRATADO",null,null,null,null,null,null,{"$f":"SUM(GETPIVOTDATA(\" B_DestartrajeNs_CT_6_11a_g\",TD!$A$140))","v":0},{"$f":"SUM(GETPIVOTDATA(\" B_DestartrajeNs_CT_Adol_g\",TD!$A$140))","v":0},{"$f":"SUM(GETPIVOTDATA(\" B_DestartrajeNs_CT_Joven_g\",TD!$A$140))","v":0},{"$f":"SUM(GETPIVOTDATA(\" B_DestartrajeNs_CT_Adulto_g\",TD!$A$140))","v":0}]
[2,"5000701","DEBRIDACIÓN DE LOS PROCESOS INFECCIOSOS BUCODENTALES","NO GESTANTE","CASO TRATADO",{"$f":"SUM(GETPIVOTDATA(\" B_Debridacion_BucodenNs_0_28d\",TD!$A$140))","v":0},{"$f":"SUM(GETPIVOTDATA(\" B_Debridacion_BucodenNs_29_5m\",TD!$A$140))","v":0},{"$f":"SUM(GETPIVOTDATA(\" B_Debridacion_BucodenNs_6_11m\",TD!$A$140))","v":0},{"$f":"SUM(GETPIVOTDATA(\" B_Debridacion_BucodenNs_1a\",TD!$A$140))","v":0},{"$f":"SUM(GETPIVOTDATA(\" B_Debridacion_BucodenNs_2a\",TD!$A$140))","v":0},{"$f":"SUM(GETPIVOTDATA(\" B_Debridacion_BucodenNs_3_5a\",TD!$A$140))","v":0},{"$f":"SUM(GETPIVOTDATA(\" B_Debridacion_BucodenNs_6_11a\",TD!$A$140))","v":0},{"$f":"SUM(GETPIVOTDATA(\" B_Debridacion_BucodenNs_Adolesc\",TD!$A$140))","v":0},{"$f":"SUM(GETPIVOTDATA(\" B_Debridacion_BucodenNs_Joven\",TD!$A$140))","v":0},{"$f":"SUM(GETPIVOTDATA(\" B_Debridacion_BucodenNs_Adulto\",TD!$A$140))","v":0},{"$f":"SUM(GETPIVOTDATA(\" B_Debridacion_BucodenNs_AdultoM\",TD!$A$140))","v":0},{"$f":"SUM(F50+G50+H50+I50+J50+K50+L50+M50+N50+O50+P50+L51+M51+N51+O51)","v":0}]
[null,null,null," GESTANTE","CASO TRATADO",null,null,null,null,null,null,{"$f":"SUM(GETPIVOTDATA(\" B_Debridacion_BucodenNs_6_11a_g\",TD!$A$140))","v":0},{"$f":"SUM(GETPIVOTDATA(\" B_Debridacion_BucodenNs_Adol_g\",TD!$A$140))","v":0},{"$f":"SUM(GETPIVOTDATA(\" B_Debridacion_BucodenNs_Joven_g\",TD!$A$140))","v":0},{"$f":"SUM(GETPIVOTDATA(\" B_Debridacion_BucodenNs_Adulto_g\",TD!$A$140))","v":0}]
[3,"5000702","CONSULTA ESTOMATOLÓGICA","NO GESTANTE","CASO TRATADO",{"$f":"SUM(GETPIVOTDATA(\" B_Consulta_EstomatoNs_0_28d\",TD!$A$140))","v":0},{"$f":"SUM(GETPIVOTDATA(\" B_Consulta_EstomatoNs_29_5m\",TD!$A$140))","v":0},{"$f":"SUM(GETPIVOTDATA(\" B_Consulta_EstomatoNs_6_11m\",TD!$A$140))","v":0},{"$f":"SUM(GETPIVOTDATA(\" B_Consulta_EstomatoNs_1a\",TD!$A$140))","v":0},{"$f":"SUM(GETPIVOTDATA(\" B_Consulta_EstomatoNs_2a\",TD!$A$140))","v":0},{"$f":"SUM(GETPIVOTDATA(\" B_Consulta_EstomatoNs_3_5a\",TD!$A$140))","v":0},{"$f":"SUM(GETPIVOTDATA(\" B_Consulta_EstomatoNs_6_11a\",TD!$A$140))","v":0},{"$f":"SUM(GETPIVOTDATA(\" B_Consulta_EstomatoNs_Adolesc\",TD!$A$140))","v":0},{"$f":"SUM(GETPIVOTDATA(\" B_Consulta_EstomatoNs_Joven\",TD!$A$140))","v":0},{"$f":"SUM(GETPIVOTDATA(\" B_Consulta_EstomatoNs_Adulto\",TD!$A$140))","v":0},{"$f":"SUM(GETPIVOTDATA(\" B_Consulta_EstomatoNs_AdultoM\",TD!$A$140))","v":0},{"$f":"SUM(F52+G52+H52+I52+J52+K52+L52+M52+N52+O52+P52+L53+M53+N53+O53)","v":0}]
[null,null,null," GESTANTE","CASO TRATADO",null,null,null,null,null,null,{"$f":"SUM(GETPIVOTDATA(\" B_Consulta_EstomatoNs_6_11a_g\",TD!$A$140))","v":0},{"$f":"SUM(GETPIVOTDATA(\" B_Consulta_EstomatoNs_Adol_g\",TD!$A$140))","v":0},{"$f":"SUM(GETPIVOTDATA(\" B_Consulta_EstomatoNs_Joven_g\",TD!$A$140))","v":0},{"$f":"SUM(GETPIVOTDATA(\" B_Consulta_EstomatoNs_Adulto_g\",TD!$A$140))","v":0}]
[4,"5000703","EXODONCIA SIMPLE","NO GESTANTE","CASO TRATADO",{"$f":"SUM(GETPIVOTDATA(\" B_Exodoncia_SimpleNs_I_0_28d\",TD!$A$140))","v":0},{"$f":"SUM(GETPIVOTDATA(\" B_Exodoncia_SimpleNs_I_29_5m\",TD!$A$140))","v":0},{"$f":"SUM(GETPIVOTDATA(\" B_Exodoncia_SimpleNs_I_6_11m\",TD!$A$140))","v":0},{"$f":"SUM(GETPIVOTDATA(\" B_Exodoncia_SimpleNs_I_1a\",TD!$A$140))","v":0},{"$f":"SUM(GETPIVOTDATA(\" B_Exodoncia_SimpleNs_I_2a\",TD!$A$140))","v":0},{"$f":"SUM(GETPIVOTDATA(\" B_Exodoncia_SimpleNs_I_3_5a\",TD!$A$140))","v":0},{"$f":"SUM(GETPIVOTDATA(\" B_Exodoncia_SimpleNs_I_6_11a\",TD!$A$140))","v":0},{"$f":"SUM(GETPIVOTDATA(\" B_Exodoncia_SimpleNs_I_Adolesc\",TD!$A$140))","v":0},{"$f":"SUM(GETPIVOTDATA(\" B_Exodoncia_SimpleNs_I_Joven\",TD!$A$140))","v":0},{"$f":"SUM(GETPIVOTDATA(\" B_Exodoncia_SimpleNs_I_Adulto\",TD!$A$140))","v":0},{"$f":"SUM(GETPIVOTDATA(\" B_Exodoncia_SimpleNs_I_AdultoM\",TD!$A$140))","v":0},{"$f":"SUM(F54+G54+H54+I54+J54+K54+L54+M54+N54+O54+P54+L55+M55+N55+O55)","v":0}]
[null,null,null," GESTANTE","CASO TRATADO",null,null,null,null,null,null,{"$f":"SUM(GETPIVOTDATA(\" B_Exodoncia_SimpleNs_I_6_11a_g\",TD!$A$140))","v":0},{"$f":"SUM(GETPIVOTDATA(\" B_Exodoncia_SimpleNs_I_Adol_g\",TD!$A$140))","v":0},{"$f":"SUM(GETPIVOTDATA(\" B_Exodoncia_SimpleNs_I_Joven_g\",TD!$A$140))","v":0},{"$f":"SUM(GETPIVOTDATA(\" B_Exodoncia_SimpleNs_I_Adulto_g\",TD!$A$140))","v":0}]
[5,"5000704","RESTAURACIONES DENTALES CON IONÓMERO DE VIDRIO","NO GESTANTE","CASO TRATADO",null,null,{"$f":"SUM(GETPIVOTDATA(\" B_Ionomero_VidrioNs_I_6_11m\",TD!$A$140))","v":0},{"$f":"SUM(GETPIVOTDATA(\" B_Ionomero_VidrioNs_I_1a\",TD!$A$140))","v":0},{"$f":"SUM(GETPIVOTDATA(\" B_Ionomero_VidrioNs_I_2a\",TD!$A$140))","v":0},{"$f":"SUM(GETPIVOTDATA(\" B_Ionomero_VidrioNs_I_3_5a\",TD!$A$140))","v":0},{"$f":"SUM(GETPIVOTDATA(\" B_Ionomero_VidrioNs_I_6_11a\",TD!$A$140))","v":0},{"$f":"SUM(GETPIVOTDATA(\" B_Ionomero_VidrioNs_I_Adolesc\",TD!$A$140))","v":0},{"$f":"SUM(GETPIVOTDATA(\" B_Ionomero_VidrioNs_I_Joven\",TD!$A$140))","v":0},{"$f":"SUM(GETPIVOTDATA(\" B_Ionomero_VidrioNs_I_Adulto\",TD!$A$140))","v":0},{"$f":"SUM(GETPIVOTDATA(\" B_Ionomero_VidrioNs_I_AdultoM\",TD!$A$140))","v":0},{"$f":"SUM(F56+G56+H56+I56+J56+K56+L56+M56+N56+O56+P56+L57+M57+N57+O57)","v":0}]
[null,null,null," GESTANTE","CASO TRATADO",null,null,null,null,null,null,{"$f":"SUM(GETPIVOTDATA(\" B_Ionomero_VidrioNs_I_6_11a_g\",TD!$A$140))","v":0},{"$f":"SUM(GETPIVOTDATA(\" B_Ionomero_VidrioNs_I_Adol_g\",TD!$A$140))","v":0},{"$f":"SUM(GETPIVOTDATA(\" B_Ionomero_VidrioNs_I_Joven_g\",TD!$A$140))","v":0},{"$f":"SUM(GETPIVOTDATA(\" B_Ionomero_VidrioNs_I_Adulto_g\",TD!$A$140))","v":0}]
[6,"5000705","RESTAURACIÓN DENTAL CON RESINA","NO GESTANTE","CASO TRATADO",null,null,{"$f":"SUM(GETPIVOTDATA(\" B_ResinaNs_I_6_11m\",TD!$A$140))","v":0},{"$f":"SUM(GETPIVOTDATA(\" B_ResinaNs_I_1a\",TD!$A$140))","v":0},{"$f":"SUM(GETPIVOTDATA(\" B_ResinaNs_I_2a\",TD!$A$140))","v":0},{"$f":"SUM(GETPIVOTDATA(\" B_ResinaNs_I_3_5a\",TD!$A$140))","v":0},{"$f":"SUM(GETPIVOTDATA(\" B_ResinaNs_I_6_11a\",TD!$A$140))","v":0},{"$f":"SUM(GETPIVOTDATA(\" B_ResinaNs_I_Adolesc\",TD!$A$140))","v":0},{"$f":"SUM(GETPIVOTDATA(\" B_ResinaNs_I_Joven\",TD!$A$140))","v":0},{"$f":"SUM(GETPIVOTDATA(\" B_ResinaNs_I_Adulto\",TD!$A$140))","v":0},{"$f":"SUM(GETPIVOTDATA(\" B_ResinaNs_I_AdultoM\",TD!$A$140))","v":0},{"$f":"SUM(H58+I58+J58+K58+L58+M58+N58+O58+P58+L59+M59+N59+O59)","v":0}]
[null,null,null," GESTANTE","CASO TRATADO",null,null,null,null,null,null,{"$f":"SUM(GETPIVOTDATA(\" B_ResinaNs_I_6_11a_g\",TD!$A$140))","v":0},{"$f":"SUM(GETPIVOTDATA(\" B_ResinaNs_I_Adol_g\",TD!$A$140))","v":0},{"$f":"SUM(GETPIVOTDATA(\" B_ResinaNs_I_Joven_g\",TD!$A$140))","v":0},{"$f":"SUM(GETPIVOTDATA(\" B_ResinaNs_I_Adulto_g\",TD!$A$140))","v":0}]
[]
[]
[null,null,"PRODUCTO: ATENCION ESTOMATOLOGICA ESPECIALIZADA (3000682)"]
[null,null,"AVANCE  DE META FISICA A NIVEL DE PRODUCTO ",null," PERSONA TRATADA",{"$f":"+Q68+Q70+Q74+Q76+Q78","v":0}]
[]
[null,"PpR","SUB PRODUCTO","CODICI,N","UNIDAD DE MEDIDA","CURSO DE VIDA \nNIÑO",null,null,null,null,null,null,"CURSO DE VIDA\n ADOLESCENTE","CURSO DE VIDA \nJOVEN","CURSO DE VIDA\n ADULTO ","CURSO DE VIDA\n ADULTO MAYOR","AVANCE  DE META FISICA A NIVEL DE SUB PRODUCTOS"]
[null,null,null,null,null,"0 - 28d","29d - 5m","6m - 11m","1 año ","2 años","3a - 5a","6a - 11a","12a - 17a","18a - 29a","30a - 59a","60 años a mas"]
[]
[1,"5000814","TERAPIA PULPAR","NO GESTANTE","CASO TRATADO",null,null,{"$f":"SUM(GETPIVOTDATA(\" B_PulpotomiaNs_I_6_11m\",TD!$A$140))","v":0},{"$f":"SUM(GETPIVOTDATA(\" B_PulpotomiaNs_I_1a\",TD!$A$140))","v":0},{"$f":"SUM(GETPIVOTDATA(\" B_PulpotomiaNs_I_2a\",TD!$A$140))","v":0},{"$f":"SUM(GETPIVOTDATA(\" B_PulpotomiaNs_I_3_5a\",TD!$A$140))","v":0},{"$f":"SUM(GETPIVOTDATA(\" B_PulpotomiaNs_I_6_11a\",TD!$A$140))","v":0},{"$f":"SUM(GETPIVOTDATA(\" B_PulpotomiaNs_I_Adolesc\",TD!$A$140))","v":0},{"$f":"SUM(GETPIVOTDATA(\" B_PulpotomiaNs_I_Joven\",TD!$A$140))","v":0},{"$f":"SUM(GETPIVOTDATA(\" B_PulpotomiaNs_I_Adulto\",TD!$A$140))","v":0},{"$f":"SUM(GETPIVOTDATA(\" B_PulpotomiaNs_I_AdultoM\",TD!$A$140))","v":0},{"$f":"SUM(H68+I68+J68+K68+L68+M68+N68+O68+P68+L69+M69+N69+O69)","v":0}]
[null,null,null," GESTANTE","CASO TRATADO",null,null,null,null,null,null,{"$f":"SUM(GETPIVOTDATA(\" B_PulpotomiaNs_I_6_11a_g\",TD!$A$140))","v":0},{"$f":"SUM(GETPIVOTDATA(\" B_PulpotomiaNs_I_Adol_g\",TD!$A$140))","v":0},{"$f":"SUM(GETPIVOTDATA(\" B_PulpotomiaNs_I_Joven_g\",TD!$A$140))","v":0},{"$f":"SUM(GETPIVOTDATA(\" B_PulpotomiaNs_I_Adulto_g\",TD!$A$140))","v":0}]
[2,"5000815","TERAPIA ENDODÓNTICA","NO GESTANTE","CASO TRATADO",null,null,{"$f":"SUM(GETPIVOTDATA(\" B_TEndodonticaNs_TA_6_11m\",TD!$A$140))","v":0},{"$f":"SUM(GETPIVOTDATA(\" B_TEndodonticaNs_TA_1a\",TD!$A$140))","v":0},{"$f":"SUM(GETPIVOTDATA(\" B_TEndodonticaNs_TA_2a\",TD!$A$140))","v":0},{"$f":"SUM(GETPIVOTDATA(\" B_TEndodonticaNs_TA_3_5a\",TD!$A$140))","v":0},{"$f":"SUM(GETPIVOTDATA(\" B_TEndodonticaNs_TA_6_11a\",TD!$A$140))","v":0},{"$f":"SUM(GETPIVOTDATA(\" B_TEndodonticaNs_TA_Adolesc\",TD!$A$140))","v":0},{"$f":"SUM(GETPIVOTDATA(\" B_TEndodonticaNs_TA_Joven\",TD!$A$140))","v":0},{"$f":"SUM(GETPIVOTDATA(\" B_TEndodonticaNs_TA_Adulto\",TD!$A$140))","v":0},{"$f":"SUM(GETPIVOTDATA(\" B_TEndodonticaNs_TA_AdultoM\",TD!$A$140))","v":0},{"$f":"SUM(H70+I70+J70+K70+L70+M70+N70+O70+P70+L71+M71+N71+O71)","v":0}]
[null,null,null," GESTANTE","CASO TRATADO",null,null,null,null,null,null,{"$f":"SUM(GETPIVOTDATA(\" B_TEndodonticaNs_TA_6_11a_g\",TD!$A$140))","v":0},{"$f":"SUM(GETPIVOTDATA(\" B_TEndodonticaNs_TA_Adol_g\",TD!$A$140))","v":0},{"$f":"SUM(GETPIVOTDATA(\" B_TEndodonticaNs_TA_Joven_g\",TD!$A$140))","v":0},{"$f":"SUM(GETPIVOTDATA(\" B_TEndodonticaNs_TA_Adulto_g\",TD!$A$140))","v":0}]
[3,"500818","TRATAMIENTO DE ORTODONCIA Y ORTOPEDIA MAXILAR","NO GESTANTE","CASO TRATADO",null,null,{"$f":"SUM(GETPIVOTDATA(\" B_OrtopediaMaxilarNs_in_6_11m\",TD!$A$140))","v":0},{"$f":"SUM(GETPIVOTDATA(\" B_OrtopediaMaxilarNs_in_1a\",TD!$A$140))","v":0},{"$f":"SUM(GETPIVOTDATA(\" B_OrtopediaMaxilarNs_in_2a\",TD!$A$140))","v":0},{"$f":"SUM(GETPIVOTDATA(\" B_OrtopediaMaxilarNs_in_3_5a\",TD!$A$140))","v":0},{"$f":"SUM(GETPIVOTDATA(\" B_OrtopediaMaxilarNs_in_6_11a\",TD!$A$140))","v":0},{"$f":"SUM(GETPIVOTDATA(\" B_OrtopediaMaxilarNs_in_Adolesc\",TD!$A$140))","v":0},{"$f":"SUM(GETPIVOTDATA(\" B_OrtopediaMaxilarNs_in_Joven\",TD!$A$140))","v":0},{"$f":"SUM(GETPIVOTDATA(\" B_OrtopediaMaxilarNs_in_Adulto\",TD!$A$140))","v":0},{"$f":"SUM(GETPIVOTDATA(\" B_OrtopediaMaxilarNs_in_AdultoM\",TD!$A$140))","v":0},{"$f":"SUM(H72+I72+J72+K72+L72+M72+N72+O72+P72+L73+M73+N73+O73)","v":0}]
[null,null,null," GESTANTE","CASO TRATADO",null,null,null,null,null,null,{"$f":"SUM(GETPIVOTDATA(\" B_OrtopediaMaxilarNs_in_6_11a_g\",TD!$A$140))","v":0},{"$f":"SUM(GETPIVOTDATA(\" B_OrtopediaMaxilarNs_in_Adol_g\",TD!$A$140))","v":0},{"$f":"SUM(GETPIVOTDATA(\" B_OrtopediaMaxilarNs_in_Joven_g\",TD!$A$140))","v":0},{"$f":"SUM(GETPIVOTDATA(\" B_OrtopediaMaxilarNs_in_Adulto_g\",TD!$A$140))","v":0}]
[4,"5000804","REHABILITACIÓN PROTÉSICA","NO GESTANTE","CASO TRATADO",null,null,null,null,null,{"$f":"SUM(GETPIVOTDATA(\" B_RehabProtesicaNs_in_3_5a\",TD!$A$140))","v":0},{"$f":"SUM(GETPIVOTDATA(\" B_RehabProtesicaNs_in_6_11a\",TD!$A$140))","v":0},{"$f":"SUM(GETPIVOTDATA(\" B_RehabProtesicaNs_in_Adolesc\",TD!$A$140))","v":0},{"$f":"SUM(GETPIVOTDATA(\" B_RehabProtesicaNs_in_Joven\",TD!$A$140))","v":0},{"$f":"SUM(GETPIVOTDATA(\" B_RehabProtesicaNs_in_Adulto\",TD!$A$140))","v":0},{"$f":"SUM(GETPIVOTDATA(\" B_RehabProtesicaNs_in_AdultoM\",TD!$A$140))","v":0},{"$f":"SUM(K74+L74+M74+N74+O74+P74+L75+M75+N75+O75)","v":0}]
[null,null,null," GESTANTE","CASO TRATADO",null,null,null,null,null,null,{"$f":"SUM(GETPIVOTDATA(\" B_RehabProtesicaNs_in_6_11a_g\",TD!$A$140))","v":0},{"$f":"SUM(GETPIVOTDATA(\" B_RehabProtesicaNs_in_Adol_g\",TD!$A$140))","v":0},{"$f":"SUM(GETPIVOTDATA(\" B_RehabProtesicaNs_in_Joven_g\",TD!$A$140))","v":0},{"$f":"SUM(GETPIVOTDATA(\" B_RehabProtesicaNs_in_Adulto_g\",TD!$A$140))","v":0}]
[5,"5000816","SUB PRODUCTO: TRATAMIENTO PERIODONTAL","NO GESTANTE","CASO TRATADO",null,null,null,null,null,{"$f":"SUM(GETPIVOTDATA(\" B_TtoPeriodontalNs_3_5a\",TD!$A$140))","v":0},{"$f":"SUM(GETPIVOTDATA(\" B_TtoPeriodontalNs_6_11a\",TD!$A$140))","v":0},{"$f":"SUM(GETPIVOTDATA(\" B_TtoPeriodontalNs_Adolesc\",TD!$A$140))","v":0},{"$f":"SUM(GETPIVOTDATA(\" B_TtoPeriodontalNs_Joven\",TD!$A$140))","v":0},{"$f":"SUM(GETPIVOTDATA(\" B_TtoPeriodontalNs_Adulto\",TD!$A$140))","v":0},{"$f":"SUM(GETPIVOTDATA(\" B_TtoPeriodontalNs_AdultoM\",TD!$A$140))","v":0},{"$f":"SUM(K76+L76+M76+N76+O76+P76+L77+M77+N77+O77)","v":0}]
[null,null,null," GESTANTE","CASO TRATADO",null,null,null,null,null,null,{"$f":"SUM(GETPIVOTDATA(\" B_TtoPeriodontalNs_6_11a_g\",TD!$A$140))","v":0},{"$f":"SUM(GETPIVOTDATA(\" B_TtoPeriodontalNs_Adol_g\",TD!$A$140))","v":0},{"$f":"SUM(GETPIVOTDATA(\" B_TtoPeriodontalNs_Joven_g\",TD!$A$140))","v":0},{"$f":"SUM(GETPIVOTDATA(\" B_TtoPeriodontalNs_Adulto_g\",TD!$A$140))","v":0}]
[6,"5000817","TRATAMIENTO QUIRÚRGICO BUCAL Y MÁXILO FACIAL","NO GESTANTE","CASO TRATADO",{"$f":"SUM(GETPIVOTDATA(\" B_MaxiloFacialNs_I_0_28d\",TD!$A$140))","v":0},{"$f":"SUM(GETPIVOTDATA(\" B_MaxiloFacialNs_I_29_5m\",TD!$A$140))","v":0},{"$f":"SUM(GETPIVOTDATA(\" B_MaxiloFacialNs_I_6_11m\",TD!$A$140))","v":0},{"$f":"SUM(GETPIVOTDATA(\" B_MaxiloFacialNs_I_1a\",TD!$A$140))","v":0},{"$f":"SUM(GETPIVOTDATA(\" B_MaxiloFacialNs_I_2a\",TD!$A$140))","v":0},{"$f":"SUM(GETPIVOTDATA(\" B_MaxiloFacialNs_3_5a\",TD!$A$140))","v":0},{"$f":"SUM(GETPIVOTDATA(\" B_MaxiloFacialNs_6_11a\",TD!$A$140))","v":0},{"$f":"SUM(GETPIVOTDATA(\" B_MaxiloFacialNs_Adolesc\",TD!$A$140))","v":0},{"$f":"SUM(GETPIVOTDATA(\" B_MaxiloFacialNs_Joven\",TD!$A$140))","v":0},{"$f":"SUM(GETPIVOTDATA(\" B_MaxiloFacialNs_Adulto\",TD!$A$140))","v":0},{"$f":"SUM(GETPIVOTDATA(\" B_MaxiloFacialNs_AdultoM\",TD!$A$140))","v":0},{"$f":"SUM(F78+G78+H78+I78+J78+K78+L78+M78+N78+O78+P78+L79+M79+N79+O79)","v":0}]
[null,null,null," GESTANTE","CASO TRATADO",null,null,null,null,null,null,{"$f":"SUM(GETPIVOTDATA(\" B_MaxiloFacialNs_6_11a_g\",TD!$A$140))","v":0},{"$f":"SUM(GETPIVOTDATA(\" B_MaxiloFacialNs_Adol_g\",TD!$A$140))","v":0},{"$f":"SUM(GETPIVOTDATA(\" B_MaxiloFacialNs_Joven_g\",TD!$A$140))","v":0},{"$f":"SUM(GETPIVOTDATA(\" B_MaxiloFacialNs_Adulto_g\",TD!$A$140))","v":0}]